program: Gaussian 16
title: Title Card Required
version: ES64L-G16RevA.03
frameworkgroup: C2V[C2(CH),SGV(C4H4),X(C4H4)]
method: RBHandHLYP
basis: def2SVP
operation: Freq
keyword: #N
keyword: Geom=AllCheck
keyword: Guess=TCheck
keyword: SCRF=Check
keyword: GenChk
keyword: RBHandHLYP/def2SVPFreq
converged: YES YES YES YES
title: Mulliken charges:
elementType: C C C C H H C H C H H H C H C H C H
charge: -0.000060 -0.026545 -0.026545 -0.000060 0.086548 0.086548 0.131678 0.113242 0.131678 0.113242 0.071704 0.071704 -0.000060 0.086548 -0.000060 0.086548 -0.013996 0.087889
chargesum: 1.00000
title: Mulliken charges with hydrogens summed into heavy atoms:
elementType: C C C C C C C C C
charge: 0.086487 0.045158 0.045158 0.086487 0.244921 0.244921 0.086487 0.086487 0.073893
1716.lowfreq: -185.5416 -4.6981 -4.1548 -0.0002 0.0006 0.0007 3.0986 313.0334 381.8051
frequency: -185.5416 313.0334 381.8051 386.7439 402.2046 448.4858 508.7186 537.4582 622.9690 726.3722 760.2049 809.5813 837.4497 846.1207 939.3681 946.4405 968.9461 969.7779 987.0169 1010.1732 1010.2851 1063.7859 1112.8505 1116.7720 1171.4932 1189.5570 1223.8971 1268.4671 1322.0806 1324.1312 1325.8927 1352.7237 1393.4974 1394.0282 1472.9733 1600.7432 1614.7996 1764.9949 1799.3077 3236.1424 3236.8880 3269.0444 3271.9125 3302.5719 3304.0314 3307.0382 3322.9354 3325.0755
redmass: 2.2612 3.5492 4.4587 2.8444 1.7266 3.0637 3.0020 5.9161 6.2169 1.2393 1.6173 2.1175 4.8298 2.5499 3.5961 1.9684 5.0325 2.7659 2.7318 1.3317 1.6780 2.1357 1.5641 1.5631 1.0168 1.1837 1.2743 1.1262 1.4864 1.3874 1.4131 1.2477 1.3209 1.4754 1.4999 2.7665 4.0169 6.0774 6.8438 1.0901 1.0906 1.0922 1.0938 1.0869 1.0883 1.0971 1.1075 1.1089
irintensity: 0.0000 0.0966 0.2799 0.1388 39.4659 0.0000 1.2612 3.2598 0.0000 6.5904 101.3214 48.1077 6.4207 0.5341 13.9651 5.2004 10.7707 0.0000 2.8388 0.0000 0.8566 0.1929 0.0007 0.0000 0.0001 12.4897 11.5129 39.3509 55.7781 17.6902 0.0000 0.0000 0.5099 36.7093 13.6861 6.2652 177.5431 6.4671 13.9939 1.4420 0.2200 0.1226 4.9827 0.0000 16.9660 7.0186 19.2050 10.2490
temp: 298.150 k
press: 1.00000 atm
elementType: 6 6 6 6 1 1 6 1 6 1 1 1 6 1 6 1 6 1
symmnumber: 2
zpe: 409725.7 jmol-1
zpe.correction: 0.156056 hartree
zpe.thermalcorrener: 0.161976 hartree
zpe.thermalcorrenthalpy: 0.162920 hartree
zpe.thermalcorrgfe: 0.126928 hartree
zpe.sumelectzpe: -347.386683 hartree
zpe.sumelectthermal: -347.380764 hartree
zpe.sumelectthermalent: -347.379819 hartree
zpe.sumelectthermalfe: -347.415811 hartree
dipole: 0.0000 0.0000 2.2429
dipole: 2.2429
quadrupole: -45.7488 -33.9864 -40.8521
quadrupole: 0.0000 0.0000 0.0000
quadrupole: -5.5530 6.2093 -0.6563 0.0000 0.0000 0.0000
hfenergy: -347.5427391 hartree
pointgroup: C02V [C2(C1H1),SGV(C4H4),X(C4H4)]
dipole: 0. 0. 0.8824341 debye
dipolederiv: 0.1182954 -0.0149472 -0.1675684 -0.2307957 -0.1033778 0.2666198 -0.130284 0.0138249 -0.1046996 -0.2174865 0. 0. 0. 0.23734 -0.2528119 0. 0.0245185 -0.3135893 -0.2174865 0. 0. 0. 0.23734 0.2528118 0. -0.0245185 -0.3135893 0.1182954 0.0149472 -0.1675684 0.2307957 -0.1033778 -0.2666198 -0.130284 -0.0138249 -0.1046996 0.0886223 -0.002102 0.0418471 0.0303964 0.1120855 -0.0430474 0.0308964 0.0007929 0.1455476 0.0886223 0.002102 0.0418471 -0.0303964 0.1120855 0.0430474 0.0308964 -0.0007929 0.1455476 0.1211738 0. 0. 0. 0.6996166 -0.0169702 0. -0.3807338 0.5612344 0.1440801 0. 0. 0. 0.1264604 0.0011666 0. -0.0099524 0.0790923 0.1211738 0. 0. 0. 0.6996166 0.0169701 0. 0.3807338 0.5612344 0.1440802 0. 0. 0. 0.1264605 -0.0011666 0. 0.0099524 0.0790923 0.0616213 0. 0. 0. 0.0074756 -0.0091711 0. -0.0071335 0.0606159 0.0616213 0. 0. 0. 0.0074756 0.0091711 0. 0.0071335 0.0606159 0.1182954 -0.0149472 0.1675684 -0.2307957 -0.1033778 -0.2666198 0.130284 -0.0138249 -0.1046996 0.0886223 -0.002102 -0.0418471 0.0303964 0.1120855 0.0430473 -0.0308964 -0.0007929 0.1455476 0.1182954 0.0149472 0.1675684 0.2307957 -0.1033778 0.2666198 0.130284 0.0138249 -0.1046996 0.0886223 0.002102 -0.0418471 -0.0303964 0.1120855 -0.0430474 -0.0308964 0.0007929 0.1455476 -0.2101044 0. 0. 0. -1.264554 0. 0. 0. -0.0179249 0.1636561 0. 0. 0. 0.087938 0. 0. 0. 0.0798264 unknown
polarizability: 62.869189|0.|96.1208795|0.|0.0000001|73.7030309 unknown
InChI: InChI=1/9C.9H
charge 1 multiplicity 1
18 atoms
C  1.23899251 0.6568851 -0.88777642
C  0.0000 1.36607401 -0.31332985
C  0.0000 -1.36607401 -0.31332985
C  1.23899251 -0.6568851 -0.88777642
H  2.04109611 1.27038968 -1.28122347
H  2.04109611 -1.27038968 -1.28122347
C  0.0000 1.20918035 1.15757046
H  0.0000 2.11315589 1.76490361
C  0.0000 -1.20918035 1.15757046
H  0.0000 -2.11315589 1.76490361
H  0.0000 -2.42244987 -0.57226745
H  0.0000 2.42244987 -0.57226745
C  -1.23899251 -0.6568851 -0.88777642
H  -2.04109611 -1.27038968 -1.28122347
C  -1.23899251 0.6568851 -0.88777642
H  -2.04109611 1.27038968 -1.28122347
C  0.0000 0.0000 1.82845585
H  0.0000 0.0000 2.91233015
