program: Gaussian 09
title: 000051705
version: EM64L-G09RevD.01
frameworkgroup: C1[X(C15H17ClN2)]
method: RPBEPBE
basis: SDD
operation: Freq
keyword: #p
keyword: freq=noraman
keyword: PBEPBE/SDD
title: #p freq=noraman PBEPBE/SDD
converged: YES YES NO NO
title: Mulliken charges:
elementType: Cl N N C C C C C C C C C C C C C C C H H H H H H H H H H H H H H H H H
charge: -0.084540 -0.077619 -0.411249 -0.406804 -0.504762 0.332445 -0.404129 0.210975 -0.407435 -0.292562 0.151518 0.215090 -0.390353 -0.710914 -0.299837 -0.348662 -0.152729 -0.224043 0.188163 0.212828 0.204762 0.220014 0.234638 0.183035 0.209908 0.170771 0.206852 0.263796 0.308119 0.229102 0.224133 0.211906 0.251337 0.234569 0.251679
chargesum: 0.00000
title: Mulliken charges with hydrogens summed into heavy atoms:
elementType: Cl N N C C C C C C C C C C C C C C C
charge: -0.084540 -0.077619 -0.103130 -0.005814 -0.079986 0.332445 0.013544 0.210975 -0.197527 0.085061 0.151518 0.215090 -0.126557 -0.045773 -0.048500 -0.114094 -0.152729 0.027636
polarizability: 2.60060173e+02 1.41194279e+00 2.14349254e+02 -2.00706173e+00 -1.97025688e+00 9.97959023e+01
1716.lowfreq: -11.7719 0.0010 0.0017 0.0018 7.1043 11.3121 26.1421 40.9687 62.5115
frequency: 24.5306 40.9282 62.3909 92.2415 105.4429 127.7531 177.8284 181.6574 215.1000 237.7391 255.4563 256.5036 289.2454 332.4104 340.1823 349.6616 364.0850 420.6982 426.8272 467.1938 505.9573 516.4611 522.7537 570.2164 576.4911 596.7099 643.3424 684.7701 724.5532 746.2658 771.1666 781.7987 793.6745 798.7741 804.2256 824.3195 871.8184 873.7031 897.7201 928.0434 943.9514 960.0196 971.7985 993.7592 1051.7160 1059.0826 1072.4714 1091.1543 1100.8894 1115.6426 1125.1274 1143.7537 1150.3858 1183.4603 1199.7020 1231.6778 1240.2242 1253.7044 1259.7722 1283.2221 1295.3453 1304.1082 1317.5629 1331.5259 1358.2506 1362.8667 1384.8570 1392.7778 1395.4830 1423.7450 1448.8356 1451.0030 1460.5310 1463.1582 1463.7795 1471.1259 1479.9991 1491.4125 1537.5800 1570.6183 1626.9776 1671.1096 2777.7603 2823.9358 2845.1431 2969.2565 2985.0271 2995.6385 3010.1231 3022.2067 3026.1617 3078.9916 3090.0268 3141.7591 3143.3884 3176.3754 3188.4076 3229.3394 3614.9341
redmass: 2.9513 4.1088 4.7706 3.4225 2.8147 5.2327 3.7920 2.2502 2.6650 3.0287 3.7246 1.5762 3.6625 3.8133 2.6790 6.7221 3.9407 2.8505 3.2223 2.6073 2.7946 2.3168 1.9836 4.2580 2.7725 6.7524 3.1829 6.3050 4.5052 3.3116 3.0175 2.0141 1.5936 1.1729 1.5274 1.4662 2.1690 2.5670 4.3216 1.3303 2.1788 2.2996 2.0949 1.9539 2.0411 2.0669 2.5824 2.1657 1.8928 1.8975 1.7894 1.3294 2.0049 1.4574 1.5667 1.4069 1.5504 1.8388 1.2838 2.1101 1.9632 1.8707 1.3886 1.3094 1.7510 1.7509 1.2379 2.6651 2.1003 2.3919 3.9485 1.1135 1.0779 1.1793 3.2273 1.0575 1.0765 1.0706 5.3632 6.7558 7.2647 7.0792 1.0717 1.0710 1.0709 1.0596 1.0374 1.0808 1.0875 1.0918 1.0963 1.0987 1.1005 1.0898 1.0902 1.0957 1.0917 1.0975 1.0810
irintensity: 0.1502 1.0546 0.4556 0.2628 0.4016 3.5431 0.7372 2.5900 0.6704 0.1647 0.4614 0.7234 1.7604 0.9155 7.3554 5.2892 0.3294 11.8410 2.7133 8.6426 18.8257 38.1642 31.3792 4.9652 26.0526 9.1312 0.5141 16.3378 8.1765 0.4895 20.3654 28.3658 55.9123 2.1808 13.1221 7.0701 24.5001 32.0397 11.1975 0.5487 8.5613 12.3771 6.1706 1.7175 20.3924 3.4290 5.4480 4.4272 42.0646 53.8643 2.5440 4.1751 31.9180 3.8378 13.9009 23.5626 10.5759 3.1921 5.7529 32.0549 22.7593 5.6848 9.5524 8.8220 17.5506 6.7392 27.5835 37.3415 20.6316 22.0771 11.4541 2.3643 10.1247 19.3996 54.7224 10.7362 3.5314 14.2982 12.1250 19.4274 4.5314 1.2032 76.9983 74.5149 178.5133 30.5963 19.2792 41.8093 15.4324 44.4203 52.9712 61.8807 35.3061 10.3435 21.3857 5.7381 0.8844 1.6866 80.6611
temp: 298.150 k
press: 1.00000 atm
elementType: 17 7 7 6 6 6 6 6 6 6 6 6 6 6 6 6 6 6 1 1 1 1 1 1 1 1 1 1 1 1 1 1 1 1 1
symmnumber: 1
zpe: 750377.3 jmol-1
zpe.correction: 0.285804 hartree
zpe.thermalcorrener: 0.302200 hartree
zpe.thermalcorrenthalpy: 0.303144 hartree
zpe.thermalcorrgfe: 0.240824 hartree
zpe.sumelectzpe: -1150.033055 hartree
zpe.sumelectthermal: -1150.016659 hartree
zpe.sumelectthermalent: -1150.015715 hartree
zpe.sumelectthermalfe: -1150.078035 hartree
dipole: -0.9578 4.1443 0.2912
dipole: 4.2634
quadrupole: -106.2339 -99.3609 -119.4658
quadrupole: 15.8422 -5.2867 -0.1715
quadrupole: 2.1197 8.9926 -11.1123 15.8422 -5.2867 -0.1715
hfenergy: -1150.3188589 hartree
pointgroup: C01 [X(C15H17Cl1N2)]
dipole: -0.2397418 -1.653005 -0.1538469 debye
polarizability: 259.9816156|2.3536886|214.4527001|2.0515362|0.9414256|99.7710138 unknown
InChI: InChI=1S/C15H17ClN2/c1-2-18-7-5-11(6-8-18)14-10-17-15-4-3-12(16)9-13(14)15/h3-5,9-10,17H,2,6-8H2,1H3
charge 0 multiplicity 1
35 atoms
Cl 3.735187 3.372049 -0.196112
N  -3.770917 0.084637 0.007119
N  2.243325 -2.398041 0.202464
C  -3.280892 -0.884906 -0.999538
C  -1.986203 -1.557951 -0.508803
C  -0.949004 -0.525703 -0.07096
C  -2.808488 1.194421 0.194162
C  0.45339 -0.967477 0.019811
C  -1.366717 0.738697 0.236788
C  -5.145548 0.559299 -0.281433
C  1.689725 -0.18417 0.03811
C  2.788256 -1.110837 0.158968
C  0.851557 -2.310747 0.10908
C  -5.768471 1.35581 0.880152
C  1.986656 1.202174 -0.077572
C  4.137783 -0.700263 0.195555
C  3.333101 1.590335 -0.042859
C  4.410953 0.678426 0.098871
H  -3.08882 -0.39581 -1.990385
H  -4.065333 -1.64885 -1.156802
H  -1.572706 -2.188941 -1.320343
H  -2.229081 -2.228023 0.340528
H  -3.04406 1.716804 1.141941
H  -2.917554 1.96711 -0.619009
H  -0.653765 1.492106 0.589111
H  -5.175783 1.182503 -1.215231
H  -5.767361 -0.336237 -0.47427
H  0.234861 -3.206891 0.135451
H  2.775164 -3.260747 0.289097
H  -5.720705 0.767962 1.813807
H  -5.253508 2.318205 1.049839
H  -6.828034 1.58206 0.660577
H  1.2045 1.95129 -0.2146
H  4.957853 -1.419794 0.291107
H  5.439938 1.047098 0.123578
