program: Gaussian 16
title: Title Card Required
version: ES64L-G16RevA.03
frameworkgroup: CS[SG(C3H3),X(C6H6)]
method: RBHandHLYP
basis: def2SVP
operation: Freq
keyword: #N
keyword: Geom=AllCheck
keyword: Guess=TCheck
keyword: SCRF=Check
keyword: GenChk
keyword: RBHandHLYP/def2SVPFreq
converged: YES YES YES YES
title: Mulliken charges:
elementType: C C C H H H C H C H C H C H C H C H
charge: -0.062136 -0.062136 -0.152581 0.104173 0.104173 0.108061 0.256732 0.093278 -0.035019 0.099151 -0.122382 0.105305 0.206515 0.083715 -0.122382 0.105305 0.206515 0.083715
chargesum: 1.00000
title: Mulliken charges with hydrogens summed into heavy atoms:
elementType: C C C C C C C C C
charge: 0.042036 0.042036 -0.044520 0.350010 0.064132 -0.017077 0.290230 -0.017077 0.290230
1716.lowfreq: -350.9443 -10.5808 -8.9073 -8.6717 -0.0005 0.0004 0.0005 271.4953 414.1034
frequency: -350.9443 271.4953 414.1034 494.3938 503.0221 522.8962 539.4516 602.9032 649.0070 688.1376 711.4320 786.9332 834.7131 869.5113 920.0924 932.8785 953.2459 967.5070 999.5254 1009.6162 1041.8922 1049.5600 1102.6879 1112.8037 1131.5750 1146.8122 1174.0154 1178.4964 1198.4556 1204.7096 1265.6947 1353.4896 1363.5919 1470.9186 1483.9270 1496.4826 1549.3722 1643.4777 1653.5159 3287.6469 3298.7598 3302.9854 3310.7594 3311.1097 3313.6195 3324.1791 3325.8902 3328.6273
redmass: 7.1268 5.0116 4.0536 2.3064 2.1997 5.1924 7.5469 6.2056 2.1937 5.9015 4.0008 1.5367 1.6864 1.5934 2.5990 2.3627 1.6827 1.9304 1.9430 1.5516 1.6025 1.3572 1.6860 1.5115 1.2850 1.2856 1.1278 1.0942 1.2241 1.3411 1.8615 1.2330 1.2448 2.6639 1.9746 2.0566 2.6974 5.0873 5.5588 1.0938 1.0929 1.0927 1.0925 1.0931 1.0943 1.0997 1.1014 1.1003
irintensity: 24.3957 0.3343 0.0117 0.3203 1.1483 2.8740 7.2736 8.8376 1.1680 0.9491 1.7352 28.7853 33.2378 0.0343 13.4201 3.8140 1.0779 23.2584 1.7400 10.6978 21.0895 1.7034 13.9383 0.3245 0.0212 11.8258 0.1916 0.1099 11.5145 1.6930 39.6324 0.5735 0.5185 4.0588 34.3170 14.5910 20.0474 2.1056 0.1873 2.2498 0.6283 5.7909 20.8975 26.4668 24.1651 28.3854 15.6887 11.0323
temp: 298.150 k
press: 1.00000 atm
elementType: 6 6 6 1 1 1 6 1 6 1 6 1 6 1 6 1 6 1
symmnumber: 1
zpe: 407304.1 jmol-1
zpe.correction: 0.155134 hartree
zpe.thermalcorrener: 0.160839 hartree
zpe.thermalcorrenthalpy: 0.161783 hartree
zpe.thermalcorrgfe: 0.125613 hartree
zpe.sumelectzpe: -347.383510 hartree
zpe.sumelectthermal: -347.377805 hartree
zpe.sumelectthermalent: -347.376860 hartree
zpe.sumelectthermalfe: -347.413031 hartree
dipole: -0.3672 0.1153 0.0000
dipole: 0.3848
quadrupole: -41.7093 -35.8404 -43.7088
quadrupole: 2.1461 0.0000 0.0000
quadrupole: -1.2898 4.5791 -3.2893 2.1461 0.0000 0.0000
hfenergy: -347.5386436 hartree
pointgroup: CS [SG(C3H3),X(C6H6)]
dipole: -0.1443619 0.0456615 0. debye
dipolederiv: 0.2081525 -0.2023916 -0.1442061 -0.1580267 0.0546848 -0.1012532 -0.1173702 -0.0162052 0.0105669 0.2081526 -0.2023916 0.1442062 -0.1580266 0.0546848 0.1012531 0.1173703 0.0162052 0.0105669 -0.0473935 0.2332104 0. 0.3139181 -0.342263 0. 0. 0. 0.1124944 0.1261953 0.0132432 -0.0395914 -0.0233662 0.1053419 0.0012145 -0.0321212 0.0200712 0.096171 0.1261953 0.0132432 0.0395914 -0.0233662 0.1053419 -0.0012145 0.0321212 -0.0200712 0.096171 0.0784527 0.0043148 0. 0.030164 0.1062193 0. 0. 0. 0.1453422 -0.0959424 0.0987485 0. 0.1842466 0.2451513 0. 0. 0. -0.0460711 0.1631446 -0.0149902 0. -0.0143729 0.1222121 0. 0. 0. 0.0775608 -0.526777 -0.0830489 0. -0.1572874 0.0635989 0. 0. 0. 0.166196 0.0788712 0.0239742 0. -0.0031959 0.0862483 0. 0. 0. 0.1428873 0.2604376 -0.0367128 0.0733634 0.0473563 -0.0995438 0.1498414 -0.2355243 0.1057632 0.1161964 0.1400642 -0.0018675 -0.0149977 0.0019702 0.1193511 0.0342786 -0.0504194 0.0026556 0.0812858 -0.1129085 0.1094187 -0.0198122 -0.0540336 0.0599008 0.0466208 -0.106324 0.0246975 -0.2564172 0.0528811 -0.0127944 0.0079121 0.0093636 0.1196818 0.0008202 0.0672806 -0.0015592 0.1529922 0.2604375 -0.0367128 -0.0733633 0.0473563 -0.0995438 -0.1498413 0.2355243 -0.1057632 0.1161965 0.1400642 -0.0018675 0.0149976 0.0019703 0.1193511 -0.0342787 0.0504194 -0.0026556 0.0812858 -0.1129085 0.1094187 0.0198121 -0.0540335 0.0599008 -0.0466208 0.106324 -0.0246975 -0.2564173 0.0528811 -0.0127944 -0.0079122 0.0093636 0.1196818 -0.0008202 -0.0672807 0.0015592 0.1529922 unknown
polarizability: 78.285649|2.0657034|85.6857697|0.|0.|76.9716312 unknown
InChI: InChI=1/9C.9H
charge 1 multiplicity 1
18 atoms
C  0.04945385 -1.29247886 0.75737832
C  0.04945385 -1.29247886 -0.75737832
C  -1.29602355 -0.80532891 0.0000
H  -0.06488471 -2.2668105 1.21816086
H  -0.06488471 -2.2668105 -1.21816086
H  -2.1107974 -1.51841042 0.0000
C  -1.51744399 0.55075194 0.0000
H  -2.52389334 0.95351981 0.0000
C  -0.39135788 1.42319216 0.0000
H  -0.5745248 2.49210398 0.0000
C  0.77235591 0.98836852 0.90824598
H  1.39528682 1.78409294 1.29742372
C  0.76980808 -0.27619322 1.42708997
H  1.33522552 -0.51132315 2.32095913
C  0.77235591 0.98836852 -0.90824598
H  1.39528682 1.78409294 -1.29742372
C  0.76980808 -0.27619322 -1.42708997
H  1.33522552 -0.51132315 -2.32095913
