program: Gaussian 16
title: Title Card Required
version: ES64L-G16RevA.03
frameworkgroup: C2V[C2(CH),SGV(C4H4),X(C4H4)]
method: RLC-wHPBE
basis: def2SVP
operation: Freq
keyword: #N
keyword: Geom=AllCheck
keyword: Guess=TCheck
keyword: SCRF=Check
keyword: GenChk
keyword: RLC-wHPBE/def2SVP
keyword: Freq
converged: YES YES YES YES
title: Mulliken charges:
elementType: C C C C H H C H C H H H C H C H C H
charge: -0.009573 -0.084564 -0.084564 -0.009573 0.105869 0.105869 0.126052 0.130188 0.126052 0.130188 0.098264 0.098264 -0.009573 0.105869 -0.009573 0.105869 -0.032032 0.106966
chargesum: 1.00000
title: Mulliken charges with hydrogens summed into heavy atoms:
elementType: C C C C C C C C C
charge: 0.096296 0.013700 0.013700 0.096296 0.256240 0.256240 0.096296 0.096296 0.074934
1716.lowfreq: -202.8038 -13.3684 -11.3690 -8.3486 -0.0007 -0.0007 -0.0004 301.1094 370.7267
frequency: -202.8035 301.1094 370.7266 374.5662 381.3524 435.7914 503.5141 518.6148 608.8879 713.3639 747.8302 807.5988 837.9985 851.5200 914.9854 936.4357 950.4296 985.1493 990.8513 995.3399 1000.9784 1067.9876 1093.9110 1096.0152 1142.1675 1158.9313 1206.0682 1238.4807 1291.8389 1295.1952 1299.2677 1316.2857 1355.9949 1366.1593 1437.4333 1583.7929 1607.5811 1759.2832 1795.2725 3202.6646 3203.2845 3223.7701 3226.2671 3263.9687 3265.1808 3265.3519 3285.0041 3287.0928
redmass: 2.2716 3.5769 4.3419 2.8770 1.7368 3.0476 3.1146 5.8877 6.2153 1.2373 1.5678 1.8287 4.8771 2.3666 3.5823 5.4724 2.0711 2.3202 2.5093 1.3621 1.5440 1.9666 1.5626 1.5393 1.0178 1.1518 1.2297 1.0990 1.5550 1.4075 1.4535 1.3587 1.3402 1.5577 1.6040 3.2551 4.7316 6.5354 7.1532 1.0908 1.0913 1.0928 1.0947 1.0876 1.0982 1.0889 1.1093 1.1107
irintensity: 0.0000 0.0555 0.3295 0.0844 40.2731 0.0000 1.3736 3.6362 0.0000 6.7783 98.5242 49.8632 8.2673 2.6905 10.7956 10.8633 2.1402 0.0000 2.1116 0.0000 0.0731 0.0480 0.0368 0.0000 0.0389 9.2167 15.2813 32.2103 61.0955 0.0000 22.0933 0.0000 2.8780 48.8982 14.8748 12.0119 192.4617 7.4486 15.4299 0.0969 0.0000 0.4834 8.6824 0.0000 10.3350 21.5570 24.5985 11.7187
temp: 298.150 k
press: 1.00000 atm
elementType: 6 6 6 6 1 1 6 1 6 1 1 1 6 1 6 1 6 1
symmnumber: 2
zpe: 404106.3 jmol-1
zpe.correction: 0.153916 hartree
zpe.thermalcorrener: 0.159967 hartree
zpe.thermalcorrenthalpy: 0.160911 hartree
zpe.thermalcorrgfe: 0.124706 hartree
zpe.sumelectzpe: -347.357897 hartree
zpe.sumelectthermal: -347.351846 hartree
zpe.sumelectthermalent: -347.350902 hartree
zpe.sumelectthermalfe: -347.387107 hartree
dipole: 0.0000 0.0000 2.1912
dipole: 2.1912
quadrupole: -45.0983 -33.2770 -40.2825
quadrupole: 0.0000 0.0000 -0.0000
quadrupole: -5.5457 6.2756 -0.7299 0.0000 0.0000 -0.0000
hfenergy: -347.5118131 hartree
pointgroup: C02V [C2(C1H1),SGV(C4H4),X(C4H4)]
dipole: 0. 0. 0.862072 debye
dipolederiv: 0.1159159 -0.0200207 -0.1598429 -0.2430564 -0.109818 0.2800471 -0.124228 0.0203453 -0.1030983 -0.2401698 0. 0. 0. 0.2060479 -0.2467686 0. 0.0525581 -0.365189 -0.2401698 0. 0. 0. 0.2060479 0.2467686 0. -0.052558 -0.365189 0.1159159 0.0200207 -0.1598429 0.2430564 -0.109818 -0.280047 -0.124228 -0.0203453 -0.1030982 0.0970915 0.0001131 0.0384377 0.0308015 0.1210466 -0.0429542 0.0253063 0.0003208 0.1458452 0.0970915 -0.0001131 0.0384377 -0.0308015 0.1210466 0.0429542 0.0253063 -0.0003208 0.1458452 0.1245523 0. 0. 0. 0.6974743 -0.0483759 0. -0.4282959 0.5874585 0.1464097 0. 0. 0. 0.1377938 0.0052037 0. -0.0045694 0.0914223 0.1245523 0. 0. 0. 0.6974743 0.0483759 0. 0.4282959 0.5874586 0.1464097 0. 0. 0. 0.1377938 -0.0052037 0. 0.0045694 0.0914223 0.0692675 0. 0. 0. 0.0324471 -0.0046249 0. -0.0044787 0.0709534 0.0692675 0. 0. 0. 0.0324472 0.0046249 0. 0.0044787 0.0709534 0.1159159 -0.0200207 0.1598429 -0.2430564 -0.109818 -0.2800471 0.124228 -0.0203453 -0.1030983 0.0970915 0.0001131 -0.0384377 0.0308015 0.1210466 0.0429542 -0.0253063 -0.0003208 0.1458452 0.1159159 0.0200207 0.1598429 0.2430564 -0.109818 0.2800471 0.124228 0.0203453 -0.1030982 0.0970915 -0.0001131 -0.0384377 -0.0308015 0.1210466 -0.0429542 -0.0253063 0.0003208 0.1458452 -0.2130163 0. 0. 0. -1.2849699 0. 0. 0. -0.0345967 0.1608673 0. 0. 0. 0.0925291 0. 0. 0. 0.0943186 unknown
polarizability: 62.8029084|0.|96.1036156|0.|0.0000001|73.9274301 unknown
InChI: InChI=1/9C.9H
charge 1 multiplicity 1
18 atoms
C  1.23587998 0.65837906 -0.88411933
C  0.0000 1.36894503 -0.3142919
C  0.0000 -1.36894503 -0.3142919
C  1.23587998 -0.65837906 -0.88411933
H  2.04539348 1.27414933 -1.27942254
H  2.04539348 -1.27414933 -1.27942254
C  0.0000 1.20942712 1.15226097
H  0.0000 2.11959936 1.76491545
C  0.0000 -1.20942712 1.15226097
H  0.0000 -2.11959936 1.76491545
H  0.0000 -2.4317547 -0.57673781
H  0.0000 2.4317547 -0.57673781
C  -1.23587998 -0.65837906 -0.88411933
H  -2.04539348 -1.27414933 -1.27942254
C  -1.23587998 0.65837906 -0.88411933
H  -2.04539348 1.27414933 -1.27942254
C  0.0000 0.0000 1.8244478
H  0.0000 0.0000 2.91596624
