program: Gaussian 09
title: 000051668
version: EM64L-G09RevD.01
frameworkgroup: C1[X(C12H11NO4)]
method: RPBEPBE
basis: SDD
operation: Freq
keyword: #p
keyword: freq=noraman
keyword: PBEPBE/SDD
title: #p freq=noraman PBEPBE/SDD
converged: YES YES NO NO
title: Mulliken charges:
elementType: O O O O N C C C C C C C C C C C C H H H H H H H H H H H
charge: -0.272211 -0.240436 -0.157133 -0.279833 -0.682993 0.396857 0.219553 -0.345281 0.021741 -0.374487 -0.557120 0.554291 -0.450715 0.078863 0.190922 -0.228473 -0.668412 0.291414 0.244633 0.260182 0.227085 0.227345 0.227495 0.318916 0.322751 0.204190 0.235037 0.235819
chargesum: 0.00000
title: Mulliken charges with hydrogens summed into heavy atoms:
elementType: O O O O N C C C C C C C C C C C C
charge: -0.272211 -0.240436 -0.157133 -0.279833 -0.041326 0.396857 0.219553 -0.053867 0.021741 -0.129853 -0.296937 0.554291 -0.223631 0.078863 0.190922 0.226367 0.006634
polarizability: 3.24643006e+02 -5.44045072e+00 1.49135750e+02 -5.16605132e-01 8.44754741e-02 6.86481812e+01
1716.lowfreq: -8.0047 0.0004 0.0005 0.0007 4.8370 7.2703 15.5781 46.5640 63.8735
frequency: 12.0435 46.2554 63.8628 81.8791 85.6862 112.2596 187.1053 193.8320 239.8411 243.0637 251.4087 273.4750 332.6922 349.9985 380.6277 405.8643 425.1944 425.3586 430.7665 450.1020 469.9757 514.1591 561.0293 613.1682 638.1031 663.7737 710.5540 719.0561 743.5618 758.1035 778.5460 797.3633 805.6765 811.9312 840.6163 862.9174 877.8323 946.3788 952.2540 986.1771 1019.6358 1043.7193 1077.9305 1113.3993 1134.1010 1137.7350 1176.8858 1201.1591 1247.6413 1256.7521 1298.9080 1329.6067 1358.4098 1374.4677 1400.7300 1413.2013 1460.7065 1461.5556 1471.5761 1485.7436 1512.6500 1543.7872 1569.8019 1603.9251 1640.8630 1649.1099 1709.9430 2997.0367 3006.0705 3065.0560 3094.1125 3110.9342 3130.5383 3135.7887 3153.1832 3161.2678 3556.7591 3696.3009
redmass: 3.9569 2.8802 6.8311 4.1648 6.9136 2.7107 5.1718 3.3091 4.0505 1.5293 5.5294 6.4123 6.3608 5.8849 4.0794 4.2385 2.6515 2.1065 2.0218 2.0101 1.4939 6.4340 7.8349 8.6478 4.0237 8.2385 8.1264 7.6851 3.1227 7.4891 8.1684 1.1090 4.2794 1.4978 5.6823 1.7594 5.0544 1.3319 2.9877 1.4369 2.2744 1.4498 4.2530 2.2525 1.4628 1.8586 2.0630 1.8892 1.1370 1.6785 2.4484 1.9047 1.5553 4.5919 1.2734 5.5858 1.0398 5.1964 1.0695 1.0693 3.9001 7.7675 9.9906 6.4834 4.0753 1.3698 12.4161 1.0365 1.0574 1.1069 1.0985 1.1021 1.0872 1.0918 1.0975 1.0929 1.0454 1.1041
irintensity: 3.4924 2.2769 0.2488 3.8267 0.5057 0.1452 1.1207 8.2783 1.0238 0.9360 2.0535 11.3731 0.8528 8.5741 1.9424 4.4062 2.5952 4.1747 28.3016 89.2427 192.6585 30.8438 0.4651 7.2872 4.0982 0.6221 10.5994 15.4153 0.2750 23.0680 18.2546 3.4974 0.9399 36.2316 15.1609 58.9761 47.4656 2.4483 8.3374 13.1129 67.5269 2.2453 171.5310 8.9120 5.9931 70.7790 132.8605 650.5931 0.0030 1.4646 69.4762 70.1943 3.8799 10.3744 25.3297 31.3951 11.5555 54.9803 6.6586 17.3030 229.0516 113.5615 335.8751 89.2227 526.8877 496.6980 388.3228 23.6470 25.1675 12.7044 33.0566 39.1462 5.7504 0.1508 17.7308 6.0171 182.3456 28.1411
temp: 298.150 k
press: 1.00000 atm
elementType: 8 8 8 8 7 6 6 6 6 6 6 6 6 6 6 6 6 1 1 1 1 1 1 1 1 1 1 1
symmnumber: 1
zpe: 549346.0 jmol-1
zpe.correction: 0.209235 hartree
zpe.thermalcorrener: 0.224873 hartree
zpe.thermalcorrenthalpy: 0.225817 hartree
zpe.thermalcorrgfe: 0.164649 hartree
zpe.sumelectzpe: -818.323905 hartree
zpe.sumelectthermal: -818.308267 hartree
zpe.sumelectthermalent: -818.307322 hartree
zpe.sumelectthermalfe: -818.368491 hartree
dipole: -6.7258 1.7975 0.0646
dipole: 6.9621
quadrupole: -46.4742 -105.0535 -100.4313
quadrupole: 2.2751 -0.0024 0.0482
quadrupole: 37.5121 -21.0671 -16.4450 2.2751 -0.0024 0.0482
hfenergy: -818.5331399 hartree
pointgroup: C01 [X(C12H11N1O4)]
dipole: 2.6415573 0.7201849 0.0788287 debye
polarizability: 324.3745812|6.2043616|149.1013923|7.3811991|2.880034|68.9509634 unknown
InChI: InChI=1S/C12H11NO4/c1-2-16-11(14)9-5-7-3-4-8(13)6-10(7)17-12(9)15/h3-6H,2,13H2,1H3
charge 0 multiplicity 1
28 atoms
O  0.699772 -1.589656 -0.164392
O  -3.398022 -0.165888 -0.25126
O  -1.512461 -2.207618 -0.241791
O  -2.624904 2.025135 -0.127831
N  5.421616 -0.60777 -0.009092
C  1.403334 0.752709 -0.07218
C  1.715942 -0.646055 -0.107898
C  0.02983 1.132212 -0.096974
C  -1.016688 0.209689 -0.155124
C  2.492151 1.676245 -0.014414
C  3.038048 -1.113882 -0.087632
C  4.105191 -0.176131 -0.030169
C  3.81349 1.23312 0.006393
C  -0.75009 -1.233951 -0.192582
C  -2.394022 0.784222 -0.17466
C  -4.795593 0.365876 -0.273021
C  -5.714993 -0.846036 -0.377714
H  -0.248896 2.192782 -0.070337
H  2.273439 2.749811 0.013369
H  3.22327 -2.192043 -0.116544
H  4.639358 1.951925 0.050535
H  -4.959474 0.949071 0.651585
H  -4.893287 1.053148 -1.133247
H  6.188858 0.05772 0.031877
H  5.647663 -1.598693 -0.034357
H  -6.76969 -0.515241 -0.396609
H  -5.50849 -1.416012 -1.29919
H  -5.573153 -1.521189 0.482861
