program: Gaussian 16
title: Title Card Required
version: ES64L-G16RevA.03
frameworkgroup: CS[SG(C3H3),X(C6H6)]
method: RPBEPBE
basis: def2SVP
operation: Freq
keyword: #N
keyword: Geom=AllCheck
keyword: Guess=TCheck
keyword: SCRF=Check
keyword: GenChk
keyword: RPBEPBE/def2SVP
keyword: Freq
converged: YES YES NO YES
title: Mulliken charges:
elementType: C C C H H H C H C H C H C H C H C H
charge: -0.036059 -0.036059 -0.145458 0.105021 0.105021 0.111478 0.242028 0.096076 -0.068178 0.089711 -0.079299 0.096109 0.170679 0.080720 -0.079299 0.096109 0.170679 0.080720
chargesum: 1.00000
title: Mulliken charges with hydrogens summed into heavy atoms:
elementType: C C C C C C C C C
charge: 0.068962 0.068962 -0.033980 0.338104 0.021533 0.016810 0.251399 0.016810 0.251399
1716.lowfreq: -0.0002 0.0003 0.0009 6.0852 13.1245 13.4793 70.9817 271.1403 381.7565
frequency: 70.9811 271.1403 381.7565 439.1835 452.8701 482.4656 510.7818 582.7194 600.0306 653.9882 719.3155 719.8041 754.5042 833.7905 858.9328 874.5747 883.9029 896.7422 905.8622 921.1141 961.2910 973.2908 1025.8207 1035.1568 1052.3935 1107.5208 1107.7520 1124.6559 1126.0200 1144.4565 1246.5709 1250.4219 1267.1737 1356.6550 1370.0437 1384.5984 1489.8862 1570.9635 1589.4896 3105.5011 3124.1936 3128.4460 3139.1021 3140.8138 3146.4475 3158.7683 3159.2731 3162.0266
redmass: 5.2041 3.9548 4.4967 2.3030 2.6004 4.5776 5.6990 4.9420 2.4173 3.7386 2.1092 1.6143 1.6470 2.3461 2.3337 1.7091 2.1521 3.2319 1.5705 1.5932 1.3237 1.9102 1.7164 1.4343 1.3218 1.0972 1.1256 1.2556 1.1363 1.2390 1.8543 1.2454 1.3221 2.9290 1.9254 2.0196 3.7780 5.9437 6.6448 1.0916 1.0914 1.0918 1.0898 1.0912 1.0906 1.1007 1.0989 1.1009
irintensity: 20.0467 3.3366 3.8991 1.3142 2.8121 0.5583 5.0218 1.5404 3.8432 1.3682 33.9028 43.7191 6.3020 4.9078 8.5435 4.1826 33.9345 5.3577 7.0114 4.3011 0.0840 13.8764 4.5033 0.0324 0.0212 1.9620 3.1450 8.3124 3.2089 0.4692 33.7448 1.3475 8.1738 5.5399 23.9162 3.0828 10.7056 6.4247 0.0357 0.7339 0.1295 5.5419 28.3797 28.2557 14.5534 14.1553 35.1186 3.7567
temp: 298.150 k
press: 1.00000 atm
elementType: 6 6 6 1 1 1 6 1 6 1 6 1 6 1 6 1 6 1
symmnumber: 1
zpe: 384379.3 jmol-1
zpe.correction: 0.146402 hartree
zpe.thermalcorrener: 0.153342 hartree
zpe.thermalcorrenthalpy: 0.154287 hartree
zpe.thermalcorrgfe: 0.115465 hartree
zpe.sumelectzpe: -347.200065 hartree
zpe.sumelectthermal: -347.193125 hartree
zpe.sumelectthermalent: -347.192180 hartree
zpe.sumelectthermalfe: -347.231002 hartree
dipole: -0.6570 -0.0648 -0.0000
dipole: 0.6602
quadrupole: -41.3189 -35.3522 -43.3783
quadrupole: 2.1675 -0.0000 -0.0000
quadrupole: -1.3024 4.6643 -3.3619 2.1675 -0.0000 -0.0000
hfenergy: -347.3464669 hartree
pointgroup: CS [SG(C3H3),X(C6H6)]
dipole: -0.2593029 -0.0152023 0. debye
dipolederiv: 0.2202399 -0.1715286 0.0751242 -0.1025468 0.1032998 -0.0429358 -0.0474012 0.0443725 0.0939894 0.2202399 -0.1715286 -0.0751242 -0.1025468 0.1032998 0.0429358 0.0474012 -0.0443725 0.0939894 -0.0271123 0.2175149 0. 0.2516546 -0.3285096 0. 0. 0. -0.0742811 0.1158041 0.0256943 -0.0343454 -0.0274896 0.1000563 -0.0014377 -0.0273505 0.0172056 0.0931725 0.1158041 0.0256943 0.0343454 -0.0274896 0.1000563 0.0014377 0.0273505 -0.0172056 0.0931725 0.08419 0.0103944 0. 0.0332619 0.1000464 0. 0. 0. 0.1384832 -0.032056 0.1043785 0. 0.1616389 0.2729347 0. 0. 0. -0.0909121 0.1539439 -0.0156228 0. -0.0174328 0.1227028 0. 0. 0. 0.1229998 -0.4670746 -0.1667437 0. -0.0387909 0.1327003 0. 0. 0. 0.0529096 0.0736505 0.0199707 0. 0.0005396 0.0592233 0. 0. 0. 0.1085954 0.189021 0.0279709 0.1717356 -0.0132232 -0.049799 -0.0185952 -0.0909373 -0.0958364 0.1759892 0.1439614 -0.0064354 0.0021276 0.0062021 0.1213343 0.0368298 -0.0605975 0.006231 0.0678898 -0.1215733 0.0704804 -0.0035493 -0.0623601 -0.0772594 0.0356734 -0.0880756 0.0572118 -0.2392974 0.0597762 -0.0311276 -0.026489 0.0039819 0.1228191 0.0049509 0.0643165 0.0096402 0.1793592 0.189021 0.0279709 -0.1717355 -0.0132232 -0.049799 0.0185952 0.0909373 0.0958364 0.1759892 0.1439613 -0.0064354 -0.0021276 0.0062021 0.1213343 -0.0368298 0.0605975 -0.006231 0.0678898 -0.1215733 0.0704804 0.0035493 -0.0623601 -0.0772594 -0.0356733 0.0880756 -0.0572118 -0.2392974 0.0597762 -0.0311276 0.026489 0.0039819 0.1228191 -0.0049509 -0.0643165 -0.0096402 0.1793592 unknown
polarizability: 80.483883|4.4644619|92.1817394|0.|0.|80.299234 unknown
InChI: InChI=1/9C.9H
charge 1 multiplicity 1
18 atoms
C  -0.04473589 -1.31067078 0.75307372
C  -0.04473589 -1.31067078 -0.75307372
C  -1.36877876 -0.71600305 0.0000
H  -0.25198256 -2.28445513 1.22380258
H  -0.25198256 -2.28445513 -1.22380258
H  -2.25477632 -1.36637379 0.0000
C  -1.46713262 0.66494377 0.0000
H  -2.44663384 1.16658911 0.0000
C  -0.23431043 1.44584728 0.0000
H  -0.36625037 2.54013151 0.0000
C  0.79315248 0.95910085 1.04665307
H  1.49268027 1.71133252 1.43917818
C  0.74164656 -0.33542588 1.47299757
H  1.32045982 -0.66563399 2.34868575
C  0.79315248 0.95910085 -1.04665307
H  1.49268027 1.71133252 -1.43917818
C  0.74164656 -0.33542588 -1.47299757
H  1.32045982 -0.66563399 -2.34868575
