program: Gaussian 16
title: Title Card Required
version: ES64L-G16RevA.03
frameworkgroup: C3H[SGH(C3H3),X(C6H6)]
method: RPBE1PBE
basis: def2SVP
operation: Freq
keyword: #N
keyword: Geom=AllCheck
keyword: Guess=TCheck
keyword: SCRF=Check
keyword: GenChk
keyword: RPBE1PBE/def2SVP
keyword: Freq
converged: YES YES YES YES
title: Mulliken charges:
elementType: C H C C H H C H C C H H C H C C H H
charge: 0.262538 0.101566 -0.140845 -0.140845 0.125459 0.125459 0.262538 0.101566 -0.140845 -0.140845 0.125459 0.125459 0.262538 0.101566 -0.140845 -0.140845 0.125459 0.125459
chargesum: 1.00000
title: Mulliken charges with hydrogens summed into heavy atoms:
elementType: C C C C C C C C C
charge: 0.364105 -0.015386 -0.015386 0.364105 -0.015386 -0.015386 0.364105 -0.015386 -0.015386
1716.lowfreq: -13.8979 -13.0514 -13.0514 -0.0046 -0.0045 -0.0024 377.5387 432.9412 432.9412
frequency: 377.5387 432.9412 432.9412 495.1079 495.1079 556.4786 556.4786 596.9596 596.9596 597.7963 665.8684 792.4549 792.4549 842.8850 899.9939 913.7451 939.3837 939.3837 952.5113 952.5113 1008.6853 1008.6853 1073.9319 1081.0438 1100.2954 1100.2954 1132.2605 1132.2605 1158.9434 1174.7741 1207.3408 1304.8534 1304.8534 1436.1249 1454.4378 1454.4378 1475.6071 1591.5058 1591.5058 3232.5783 3232.5783 3237.3040 3237.3040 3238.5625 3242.4857 3251.2538 3251.2538 3255.2767
redmass: 3.4000 8.3394 8.3394 1.9824 1.9824 6.7001 6.7001 6.3513 6.3513 1.8985 6.2282 1.6964 1.6964 1.6892 2.5805 5.4563 1.0769 1.0769 3.1104 3.1104 1.4481 1.4481 1.2797 1.2766 1.4720 1.4720 1.0729 1.0729 1.1970 1.3714 1.7650 1.2270 1.2270 3.0401 2.1951 2.1951 2.7076 5.5987 5.5987 1.0919 1.0919 1.0952 1.0952 1.0907 1.0940 1.0990 1.0990 1.1014
irintensity: 0.0000 0.0000 0.0000 0.0185 0.0185 0.0000 0.0000 9.5514 9.5515 0.0000 0.0000 38.4411 38.4400 0.0000 2.3080 0.0000 0.0000 0.0000 12.6322 12.6322 16.5399 16.5401 0.0000 0.0000 8.0173 8.0172 0.0000 0.0000 20.4830 0.0000 61.2481 0.0000 0.0000 0.0000 28.0135 28.0133 4.9495 0.0000 0.0000 1.0016 1.0017 0.0000 0.0000 0.0000 53.8541 54.6797 54.6807 0.0000
temp: 298.150 k
press: 1.00000 atm
elementType: 6 1 6 6 1 1 6 1 6 6 1 1 6 1 6 6 1 1
symmnumber: 3
zpe: 399552.4 jmol-1
zpe.correction: 0.152181 hartree
zpe.thermalcorrener: 0.158183 hartree
zpe.thermalcorrenthalpy: 0.159127 hartree
zpe.thermalcorrgfe: 0.123672 hartree
zpe.sumelectzpe: -347.233621 hartree
zpe.sumelectthermal: -347.227620 hartree
zpe.sumelectthermalent: -347.226675 hartree
zpe.sumelectthermalfe: -347.262130 hartree
dipole: 0.0000 0.0000 -0.0000
dipole: 0.0000
quadrupole: -42.6502 -42.6502 -34.6298
quadrupole: 0.0000 -0.0000 -0.0000
quadrupole: -2.6735 -2.6735 5.3469 0.0000 -0.0000 -0.0000
hfenergy: -347.3858022 hartree
pointgroup: C03H [SGH(C3H3),X(C6H6)]
dipole: 0. 0. 0. debye
dipolederiv: -0.0582502 -0.0000067 0. -0.0000048 -0.2700187 0. 0. 0. 0.2060227 0.0581579 0.0000055 0. -0.0000007 0.1744419 0. 0. 0. 0.118156 0.2694668 -0.0000027 0.0000034 -0.0000024 -0.1174279 0.1692453 -0.000008 0.2142296 -0.1124974 0.2694668 -0.0000027 -0.0000034 -0.0000024 -0.1174279 -0.1692453 0.000008 -0.2142296 -0.1124974 0.1536919 0.0000025 0.0000018 0. 0.0754403 0.010416 -0.0000003 -0.0231657 0.1170744 0.1536919 0.0000025 -0.0000018 0. 0.0754403 -0.010416 0.0000003 0.0231657 0.1170744 -0.2170746 0.0916976 0. 0.0917016 -0.1111942 0. 0. 0. 0.2060227 0.1453711 -0.0503517 0. -0.0503529 0.0872286 0. 0. 0. 0.118156 -0.0207027 0.1675317 0.1465698 0.1675308 0.1727416 -0.0846244 0.1855283 -0.1071146 -0.1124974 -0.0207027 0.1675317 -0.1465698 0.1675308 0.1727416 0.0846244 -0.1855284 0.1071146 -0.1124974 0.0950032 0.0338842 0.0090206 0.0338838 0.134129 -0.0052078 -0.020062 0.011583 0.1170744 0.0950032 0.0338842 -0.0090206 0.0338838 0.134129 0.0052078 0.020062 -0.011583 0.1170744 -0.2170801 -0.0916982 0. -0.0916952 -0.1111887 0. 0. 0. 0.206022 0.1453729 0.0503546 0. 0.0503509 0.0872282 0. 0. 0. 0.1181564 -0.0207095 -0.1675291 -0.1465714 -0.1675295 0.1727417 -0.0846199 -0.1855246 -0.1071174 -0.1124985 -0.0207095 -0.1675291 0.1465714 -0.1675295 0.1727417 0.0846199 0.1855246 0.1071174 -0.1124985 0.0950041 -0.033884 -0.0090205 -0.0338854 0.1341293 -0.005207 0.0200632 0.0115832 0.1170762 0.0950041 -0.033884 0.0090205 -0.0338854 0.1341293 0.005207 -0.0200632 -0.0115832 0.1170762 unknown
polarizability: 78.7715615|0.0000301|78.7715265|0.|0.|87.1535526 unknown
InChI: InChI=1/9C.9H
charge 1 multiplicity 1
18 atoms
C  0.00000063 1.63155623 0.0000
H  -0.00000622 2.72273391 0.0000
C  0.00000192 0.91433068 1.2017655
C  0.00000192 0.91433068 -1.2017655
H  0.00000444 1.43123773 -2.16331994
H  0.00000444 1.43123773 2.16331994
C  1.41296858 -0.81577824 0.0000
H  2.35795959 -1.36136114 0.0000
C  0.79183239 -0.45716657 1.2017655
C  0.79183239 -0.45716657 -1.2017655
H  1.23948576 -0.71562228 -2.16331994
H  1.23948576 -0.71562228 2.16331994
C  -1.41296921 -0.81577714 0.0000
H  -2.35795337 -1.36137191 0.0000
C  -0.7918343 -0.45716325 1.2017655
C  -0.7918343 -0.45716325 -1.2017655
H  -1.2394902 -0.71561459 -2.16331994
H  -1.2394902 -0.71561459 2.16331994
