program: Gaussian 16
title: Title Card Required
version: ES64L-G16RevA.03
frameworkgroup: CS[SG(C3H3),X(C6H6)]
method: RPBE1PBE
basis: def2SVP
operation: Freq
keyword: #N
keyword: Geom=AllCheck
keyword: Guess=TCheck
keyword: SCRF=Check
keyword: GenChk
keyword: RPBE1PBE/def2SVP
keyword: Freq
converged: YES YES YES YES
title: Mulliken charges:
elementType: C C C H H H C H C H C H C H C H C H
charge: -0.039867 -0.039867 -0.183885 0.127300 0.127300 0.132910 0.249474 0.126458 -0.153809 0.106364 -0.056036 0.108304 0.121533 0.100010 -0.056036 0.108304 0.121533 0.100010
chargesum: 1.00000
title: Mulliken charges with hydrogens summed into heavy atoms:
elementType: C C C C C C C C C
charge: 0.087434 0.087434 -0.050975 0.375932 -0.047445 0.052268 0.221543 0.052268 0.221543
1716.lowfreq: -4.3742 -4.1705 -0.0005 0.0005 0.0007 4.2278 246.1031 268.6043 357.9150
frequency: 246.1030 268.6043 357.9150 417.5659 451.1571 521.8379 530.8707 580.8836 616.6107 677.9556 750.7621 760.6431 785.7516 876.8590 893.3955 893.6942 921.8437 927.7851 961.2480 969.4931 1009.1545 1034.2344 1054.1694 1061.4427 1103.8295 1146.8054 1153.4749 1164.0693 1187.0887 1216.2702 1301.6418 1311.0496 1327.7547 1409.2740 1416.5233 1428.2094 1571.1593 1684.0990 1693.4801 3184.6184 3206.5527 3211.7027 3225.3092 3225.6244 3227.2984 3249.3106 3250.1639 3254.6470
redmass: 3.6858 3.7277 3.3847 2.7972 2.8093 4.2351 5.0959 5.3994 2.5813 3.1668 1.5910 1.6735 2.0886 2.9213 2.2012 1.9333 2.3529 3.1051 1.4340 1.4053 1.8460 1.5282 1.8321 1.4620 1.2590 1.1555 1.0729 1.1235 1.1828 1.3481 1.2522 1.4026 1.5918 1.8800 3.2041 1.9305 4.1395 6.2847 6.8655 1.0915 1.0918 1.0930 1.0929 1.0899 1.0912 1.1019 1.1011 1.1001
irintensity: 15.0040 10.8086 10.8203 0.0762 6.2138 7.5482 10.7059 3.7878 3.3893 4.0398 47.5541 72.0815 0.9377 4.0843 5.9341 1.3048 45.3043 11.7231 7.8880 0.5671 10.0478 1.6918 9.2644 0.2803 0.1049 10.2677 0.3085 1.7699 0.1440 13.1532 1.9884 8.5537 39.7958 26.8259 13.3853 1.0527 20.6672 11.6117 0.7249 0.2091 1.2863 7.0818 32.2922 22.7947 9.4146 11.1974 25.6174 10.9142
temp: 298.150 k
press: 1.00000 atm
elementType: 6 6 6 1 1 1 6 1 6 1 6 1 6 1 6 1 6 1
symmnumber: 1
zpe: 399073.8 jmol-1
zpe.correction: 0.151999 hartree
zpe.thermalcorrener: 0.158472 hartree
zpe.thermalcorrenthalpy: 0.159416 hartree
zpe.thermalcorrgfe: 0.121926 hartree
zpe.sumelectzpe: -347.229511 hartree
zpe.sumelectthermal: -347.223039 hartree
zpe.sumelectthermalent: -347.222094 hartree
zpe.sumelectthermalfe: -347.259584 hartree
dipole: -1.2384 -0.2198 0.0000
dipole: 1.2577
quadrupole: -41.1600 -35.1602 -43.7805
quadrupole: 1.7734 -0.0000 0.0000
quadrupole: -1.1264 4.8734 -3.7470 1.7734 -0.0000 0.0000
hfenergy: -347.3815103 hartree
pointgroup: CS [SG(C3H3),X(C6H6)]
dipole: -0.4881527 -0.0809544 0. debye
dipolederiv: 0.3696216 -0.2093262 0.1871466 -0.0975994 0.160273 -0.0396996 -0.0331322 0.1160336 0.1544477 0.3696216 -0.2093262 -0.1871466 -0.0975994 0.160273 0.0396996 0.0331322 -0.1160336 0.1544477 -0.2201452 0.3282103 0. 0.4360065 -0.4881882 0. 0. 0. -0.2483202 0.0971462 0.0369462 -0.0330806 -0.0296174 0.1016105 -0.0044991 -0.0274546 0.010379 0.1004203 0.0971462 0.0369462 0.0330806 -0.0296174 0.1016105 0.0044991 0.0274546 -0.010379 0.1004203 0.0932045 0.0174272 0. 0.0378683 0.1066667 0. 0. 0. 0.1452133 0.088739 0.1061514 0. 0.0438984 0.4337624 0. 0. 0. -0.0473272 0.1542888 -0.0172503 0. -0.0192497 0.1318134 0. 0. 0. 0.1584238 -0.5311999 -0.2424602 0. -0.025364 0.1675077 0. 0. 0. -0.0910076 0.07469 0.0170404 0. 0.0038907 0.0483265 0. 0. 0. 0.0973234 0.1613489 0.0753948 0.2302123 -0.0500418 -0.049162 -0.078868 0.0108665 -0.1356418 0.2171137 0.1462486 -0.0091219 -0.0096666 0.0119876 0.1234791 0.0362983 -0.0679973 0.0015628 0.0761785 -0.1756573 0.0376154 0.0248007 -0.0625982 -0.1568328 0.0475979 -0.0695125 0.052524 -0.2325142 0.0715035 -0.0360677 -0.0438378 -0.0106557 0.120688 0.0031866 0.0463935 0.0184937 0.1772012 0.1613489 0.0753948 -0.2302123 -0.0500418 -0.049162 0.078868 -0.0108665 0.1356418 0.2171137 0.1462486 -0.0091219 0.0096666 0.0119876 0.1234791 -0.0362983 0.0679973 -0.0015628 0.0761785 -0.1756573 0.0376154 -0.0248007 -0.0625982 -0.1568328 -0.0475979 0.0695125 -0.052524 -0.2325142 0.0715035 -0.0360677 0.0438378 -0.0106557 0.120688 -0.0031866 -0.0463935 -0.0184937 0.1772012 unknown
polarizability: 74.6948731|3.4286341|90.827668|0.|0.|75.348649 unknown
InChI: InChI=1/9C.9H
charge 1 multiplicity 1
18 atoms
C  -0.03386137 -1.30260621 0.73671209
C  -0.03386137 -1.30260621 -0.73671209
C  -1.3571419 -0.71266895 0.0000
H  -0.26441275 -2.2608319 1.21179656
H  -0.26441275 -2.2608319 -1.21179656
H  -2.24632608 -1.34458118 0.0000
C  -1.42564372 0.65475561 0.0000
H  -2.39104821 1.17002042 0.0000
C  -0.17703608 1.42345671 0.0000
H  -0.33146077 2.50736892 0.0000
C  0.75426291 0.9624925 1.12841687
H  1.41498249 1.71235425 1.568472
C  0.739687 -0.32816901 1.49094876
H  1.3359496 -0.69060039 2.33187231
C  0.75426291 0.9624925 -1.12841687
H  1.41498249 1.71235425 -1.568472
C  0.739687 -0.32816901 -1.49094876
H  1.3359496 -0.69060039 -2.33187231
