program: Gaussian 16
title: TitleCard Required
version: ES64L-G16RevA.03
frameworkgroup: C3H[SGH(C3H3),X(C6H6)]
method: RM06
basis: def2SVP
operation: Freq
keyword: #NGeom=AllCheck
keyword: Guess=TCheck
keyword: SCRF=Check
keyword: GenChk
keyword: RM06/def2SVP
keyword: Freq
title: Title Card Required
converged: YES YES YES YES
title: Mulliken charges:
elementType: C H C C H H C H C C H H C H C C H H
charge: 0.247172 0.100487 -0.127829 -0.127829 0.120666 0.120666 0.247172 0.100487 -0.127829 -0.127829 0.120666 0.120666 0.247172 0.100487 -0.127829 -0.127829 0.120666 0.120666
chargesum: 1.00000
title: Mulliken charges with hydrogens summed into heavy atoms:
elementType: C C C C C C C C C
charge: 0.347659 -0.007163 -0.007163 0.347659 -0.007163 -0.007163 0.347659 -0.007163 -0.007163
chargesum: 0.99881
1716.lowfreq: -0.1252 -0.1252 -0.1252 9.0538 34.8316 34.8316 372.7114 452.6980 452.6980
frequency: 372.7114 452.6846 452.6846 488.8406 488.8406 559.3494 559.3494 593.8179 595.2857 595.2857 658.3879 784.1810 784.1810 832.5236 891.0909 906.5235 922.6642 922.6642 938.1609 938.1609 995.2365 995.2365 1050.5916 1059.0786 1081.7167 1081.7167 1105.3860 1105.3860 1131.8771 1152.5556 1183.1451 1274.6869 1274.6869 1412.3486 1430.4888 1430.4888 1453.0017 1572.6302 1572.6302 3186.0743 3186.0743 3189.2625 3189.2625 3190.0187 3191.8458 3208.6601 3208.6601 3211.4202
redmass: 3.3995 8.2665 8.2665 2.0160 2.0160 6.6045 6.6045 1.9391 5.8864 5.8864 6.1745 1.6697 1.6697 1.6569 2.5254 5.4595 1.0781 1.0781 3.1426 3.1426 1.4427 1.4427 1.2797 1.2775 1.4425 1.4425 1.0662 1.0662 1.1170 1.3070 1.9225 1.2282 1.2282 3.4327 2.3343 2.3343 2.8780 5.8530 5.8530 1.0924 1.0924 1.0948 1.0948 1.0919 1.0939 1.0978 1.0978 1.0997
irintensity: 0.0000 0.0001 0.0000 0.0740 0.0724 0.0000 0.0000 0.0002 10.4511 10.4915 0.0001 33.9478 33.9278 0.0004 2.4882 0.0000 0.0005 0.0002 12.8491 12.9370 14.6225 14.6254 0.0022 0.0000 7.2666 7.2745 0.0000 0.0000 9.6970 0.0000 54.4989 0.0000 0.0000 0.0000 23.3113 23.3026 2.3435 0.0000 0.0001 0.1373 0.1450 0.0001 0.0005 0.0004 33.6349 37.4265 37.2990 0.0003
temp: 298.150 k
press: 1.00000 atm
elementType: 6 1 6 6 1 1 6 1 6 6 1 1 6 1 6 6 1 1
symmnumber: 3
zpe: 393939.6 jmol-1
zpe.correction: 0.150044 hartree
zpe.thermalcorrener: 0.156080 hartree
zpe.thermalcorrenthalpy: 0.157024 hartree
zpe.thermalcorrgfe: 0.121536 hartree
zpe.sumelectzpe: -347.349770 hartree
zpe.sumelectthermal: -347.343734 hartree
zpe.sumelectthermalent: -347.342790 hartree
zpe.sumelectthermalfe: -347.378278 hartree
dipole: -0.0000 0.0000 0.0000
dipole: 0.0000
quadrupole: -42.6681 -42.6681 -35.2540
quadrupole: -0.0000 0.0000 -0.0000
quadrupole: -2.4714 -2.4714 4.9427 -0.0000 0.0000 -0.0000
hfenergy: -347.4998137 hartree
pointgroup: C03H [SGH(C3H3),X(C6H6)]
dipole: 0. 0. 0. debye
dipolederiv: -0.0436467 0.0009574 0. -0.0007076 -0.2469561 0. 0. 0. 0.2038458 0.0458924 -0.001598 0. 0.000078 0.1441 0. 0. 0. 0.1060666 0.274016 0.0011308 0.0009228 0.0005601 -0.0987828 0.147209 0.0001862 0.2296445 -0.0851015 0.274016 0.0011308 -0.0009228 0.0005601 -0.0987828 -0.147209 -0.0001862 -0.2296445 -0.0851015 0.1463229 -0.0004603 0.0008531 0.0000163 0.0618217 0.0128281 0.0001468 -0.0145849 0.0958873 0.1463229 -0.0004603 -0.0008531 0.0000163 0.0618217 -0.0128281 -0.0001468 0.0145849 0.0958873 -0.1974671 0.0894066 0. 0.0885032 -0.0946785 0. 0. 0. 0.203291 0.1206181 -0.0432281 0. -0.0423839 0.0703083 0. 0. 0. 0.1061215 -0.0055233 0.1609294 0.1273893 0.1606621 0.1815693 -0.0739067 0.1995011 -0.1150921 -0.0829629 -0.0055233 0.1609294 -0.1273893 0.1606621 0.1815693 0.0739067 -0.1995011 0.1150921 -0.0829629 0.0829275 0.0366383 0.0110146 0.036891 0.1251029 -0.0068668 -0.0124594 0.0071087 0.0953873 0.0829275 0.0366383 -0.0110146 0.036891 0.1251029 0.0068668 0.0124594 -0.0071087 0.0953873 -0.1961822 -0.0879336 0. -0.0880758 -0.0944204 0. 0. 0. 0.2038448 0.1195448 0.0425207 0. 0.0425332 0.0704474 0. 0. 0. 0.1060666 -0.00525 -0.1616389 -0.1273355 -0.1616025 0.1804802 -0.0738689 -0.1987065 -0.1151211 -0.0851027 -0.00525 -0.1616389 0.1273355 -0.1616024 0.1804802 0.0738689 0.1987065 0.1151211 -0.0851027 0.0829319 -0.0365954 -0.0111218 -0.0365671 0.1252128 -0.0063923 0.012631 0.0072924 0.0958873 0.0829319 -0.0365954 0.0111218 -0.0365671 0.1252128 0.0063923 -0.012631 -0.0072924 0.0958873 unknown
polarizability: 80.3096053|0.0484789|80.365594|0.|0.|87.98223 unknown
InChI: InChI=1/9C.9H
charge 1 multiplicity 1
18 atoms
C  0.00001452 1.63024985 0.0000
H  0.00002617 2.72207824 0.0000
C  -0.00000279 0.91325359 1.2012804
C  -0.00000279 0.91325359 -1.2012804
H  -0.00003136 1.42834996 -2.1654333
H  -0.00003136 1.42834996 2.1654333
C  1.41183028 -0.81513707 0.0000
H  2.35737557 -1.36106136 0.0000
C  0.79090196 -0.45662395 1.2012804
C  0.79090196 -0.45662395 -1.2012804
H  1.23700278 -0.71414739 -2.1654333
H  1.23700278 -0.71414739 2.1654333
C  -1.41184479 -0.81511192 0.0000
H  -2.35740175 -1.36101603 0.0000
C  -0.79089916 -0.45662878 1.2012804
C  -0.79089916 -0.45662878 -1.2012804
H  -1.23697142 -0.71420171 -2.1654333
H  -1.23697142 -0.71420171 2.1654333
