program: Gaussian 16
title: Title Card Required
version: ES64L-G16RevA.03
frameworkgroup: CS[SG(C3H3),X(C6H6)]
method: RB1B95
basis: def2SVP
operation: Freq
keyword: #N
keyword: Geom=AllCheck
keyword: Guess=TCheck
keyword: SCRF=Check
keyword: GenChk
keyword: RB1B95/def2SVP
keyword: Freq
converged: YES YES YES YES
title: Mulliken charges:
elementType: C C C H H H C H C H C H C H C H C H
charge: -0.066342 -0.066342 -0.175784 0.114210 0.114210 0.118529 0.296459 0.103134 -0.123266 0.102888 -0.098456 0.107419 0.194564 0.087625 -0.098456 0.107419 0.194564 0.087625
chargesum: 1.00000
title: Mulliken charges with hydrogens summed into heavy atoms:
elementType: C C C C C C C C C
charge: 0.047867 0.047867 -0.057256 0.399593 -0.020378 0.008963 0.282189 0.008963 0.282189
1716.lowfreq: -250.6096 -6.8940 0.0005 0.0006 0.0008 17.9948 25.7243 292.5444 407.3980
frequency: -250.6053 292.5440 407.3973 459.6928 473.1131 503.4858 517.0120 601.5220 625.6365 674.2187 741.0752 752.0798 795.8405 858.9340 889.0415 910.2296 921.9865 930.3256 955.5057 971.7829 1007.8027 1008.0877 1067.4141 1076.8689 1094.6928 1139.8951 1143.2017 1154.0083 1166.3937 1180.1408 1288.1822 1298.3107 1315.4487 1420.5112 1431.1066 1442.1137 1543.3896 1630.0228 1651.1854 3207.8708 3223.7942 3228.2091 3238.7839 3239.2213 3240.8064 3256.2528 3257.8177 3259.4434
redmass: 5.9005 3.7578 4.7290 2.3442 2.4789 5.1000 6.0688 5.2342 2.3721 3.9703 2.3751 1.6013 1.5661 2.2498 2.1902 1.7239 2.1223 3.8357 1.4910 1.5078 1.3204 1.8017 1.6406 1.4540 1.2786 1.1766 1.1214 1.1969 1.1017 1.2618 2.0007 1.2440 1.3006 2.8683 2.0838 2.0944 3.6214 5.7358 6.4846 1.0927 1.0921 1.0926 1.0910 1.0924 1.0920 1.0998 1.1019 1.1012
irintensity: 27.8719 1.7953 3.7656 1.3814 1.7992 0.0206 4.4782 3.2846 2.9275 1.8808 24.5242 44.1292 14.6948 3.5034 7.6655 6.4831 37.5932 4.5182 3.9077 3.5826 0.2533 17.2353 6.0728 0.0088 0.0313 6.6541 2.5455 5.5374 3.5566 1.0034 37.9397 1.3798 6.2746 4.8478 35.5935 4.7823 13.1632 7.4468 0.0022 1.4879 0.0809 5.9070 27.3349 32.2267 13.7634 30.2768 14.0982 10.0481
temp: 298.150 k
press: 1.00000 atm
elementType: 6 6 6 1 1 1 6 1 6 1 6 1 6 1 6 1 6 1
symmnumber: 1
zpe: 397712.9 jmol-1
zpe.correction: 0.151481 hartree
zpe.thermalcorrener: 0.157347 hartree
zpe.thermalcorrenthalpy: 0.158291 hartree
zpe.thermalcorrgfe: 0.121892 hartree
zpe.sumelectzpe: -347.459662 hartree
zpe.sumelectthermal: -347.453796 hartree
zpe.sumelectthermalent: -347.452852 hartree
zpe.sumelectthermalfe: -347.489251 hartree
dipole: -0.6733 0.0205 -0.0000
dipole: 0.6736
quadrupole: -41.0308 -35.1837 -43.5512
quadrupole: 2.1369 -0.0000 -0.0000
quadrupole: -1.1089 4.7382 -3.6293 2.1369 -0.0000 -0.0000
hfenergy: -347.6111429 hartree
pointgroup: CS [SG(C3H3),X(C6H6)]
dipole: -0.2650322 0.0008255 0. debye
dipolederiv: 0.2653891 -0.1860233 0.0316042 -0.1104063 0.0818519 -0.0516 -0.0609441 0.0368827 0.0793445 0.2653891 -0.1860233 -0.0316042 -0.1104063 0.0818519 0.0516 0.0609441 -0.0368827 0.0793445 -0.1030821 0.2709246 0. 0.3259581 -0.3479559 0. 0. 0. -0.0548396 0.1180766 0.0232234 -0.0348304 -0.025447 0.1055537 -0.0037358 -0.0303942 0.0143059 0.0979874 0.1180766 0.0232234 0.0348304 -0.025447 0.1055537 0.0037358 0.0303942 -0.0143059 0.0979874 0.0841674 0.010591 0. 0.0317057 0.1064859 0. 0. 0. 0.1410819 -0.0285405 0.0838723 0. 0.1476094 0.3215929 0. 0. 0. -0.062156 0.1612656 -0.0140457 0. -0.0156584 0.1228745 0. 0. 0. 0.1141841 -0.5419594 -0.1917297 0. -0.1027595 0.0909977 0. 0. 0. 0.0486369 0.076608 0.0204724 0. -0.0007581 0.074539 0. 0. 0. 0.1214829 0.2274491 0.0288052 0.1640081 0.0213179 -0.0540938 0.0351457 -0.1589418 -0.0785377 0.1752713 0.1430003 -0.0031095 -0.0060167 0.0079892 0.1233713 0.0369704 -0.0586233 0.004594 0.0744705 -0.1356624 0.0773206 0.0000075 -0.0880621 -0.0621265 0.0313589 -0.0945935 0.04325 -0.2548406 0.0575177 -0.0302588 -0.0213554 0.0015597 0.1211763 0.0040012 0.0670385 0.0108578 0.173572 0.2274491 0.0288052 -0.1640081 0.0213179 -0.0540938 -0.0351457 0.1589417 0.0785377 0.1752713 0.1430003 -0.0031095 0.0060167 0.0079892 0.1233713 -0.0369704 0.0586233 -0.004594 0.0744705 -0.1356624 0.0773206 -0.0000075 -0.0880621 -0.0621265 -0.0313589 0.0945935 -0.04325 -0.2548405 0.0575177 -0.0302588 0.0213554 0.0015597 0.1211763 -0.0040012 -0.0670385 -0.0108578 0.173572 unknown
polarizability: 77.8002355|2.9366728|88.8000175|0.|0.|77.0539762 unknown
InChI: InChI=1/9C.9H
charge 1 multiplicity 1
18 atoms
C  0.05326797 -1.29281455 0.74751153
C  0.05326797 -1.29281455 -0.74751153
C  -1.29528607 -0.80870685 0.0000
H  -0.07507653 -2.27015617 1.21355317
H  -0.07507653 -2.27015617 -1.21355317
H  -2.12130189 -1.51767477 0.0000
C  -1.50094343 0.54875913 0.0000
H  -2.50852313 0.96563421 0.0000
C  -0.35135616 1.41723984 0.0000
H  -0.55779153 2.48854507 0.0000
C  0.73279518 1.00499391 0.9988199
H  1.3697642 1.80104108 1.38214176
C  0.76772727 -0.27174648 1.44924099
H  1.36934802 -0.5446461 2.31572742
C  0.73279518 1.00499391 -0.9988199
H  1.3697642 1.80104108 -1.38214176
C  0.76772727 -0.27174648 -1.44924099
H  1.36934802 -0.5446461 -2.31572742
