program: Gaussian 16
title: Title Card Required
version: ES64L-G16RevA.03
frameworkgroup: C3H[SGH(C3H3),X(C6H6)]
method: RB3PW91
basis: def2SVP
operation: Freq
keyword: #N
keyword: Geom=AllCheck
keyword: Guess=TCheck
keyword: SCRF=Check
keyword: GenChk
keyword: RB3PW91/def2SVP
keyword: Freq
converged: YES YES YES YES
title: Mulliken charges:
elementType: C H C C H H C H C C H H C H C C H H
charge: 0.249159 0.098937 -0.129417 -0.129417 0.122036 0.122036 0.249159 0.098937 -0.129417 -0.129417 0.122036 0.122036 0.249159 0.098937 -0.129417 -0.129417 0.122036 0.122036
chargesum: 1.00000
title: Mulliken charges with hydrogens summed into heavy atoms:
elementType: C C C C C C C C C
charge: 0.348095 -0.007381 -0.007381 0.348095 -0.007381 -0.007381 0.348095 -0.007381 -0.007381
1716.lowfreq: -13.1451 -13.1451 -12.9019 -0.0046 -0.0045 -0.0003 376.4111 414.8780 414.8780
frequency: 376.4111 414.8780 414.8780 492.3499 492.3499 550.9570 550.9570 584.7960 584.7960 594.9729 662.5980 787.0979 787.0979 838.2917 887.7157 902.0223 936.6416 936.6416 947.0163 947.0163 1001.9070 1001.9070 1070.4365 1077.0794 1095.1769 1095.1769 1130.4849 1130.4849 1155.0851 1167.3424 1198.9992 1302.4888 1302.4888 1421.6182 1445.6861 1445.6861 1465.7397 1575.5186 1575.5186 3217.2800 3217.2800 3221.7247 3221.7247 3222.9865 3226.6917 3235.7601 3235.7601 3239.6418
redmass: 3.4011 8.3341 8.3341 1.9928 1.9928 6.7631 6.7631 6.6615 6.6615 1.9056 6.2686 1.6868 1.6868 1.6877 2.6890 5.4643 1.0780 1.0780 3.1563 3.1563 1.4377 1.4377 1.2795 1.2740 1.4866 1.4866 1.0765 1.0765 1.2656 1.4158 1.6311 1.2255 1.2255 2.8372 2.1367 2.1367 2.6079 5.4644 5.4644 1.0918 1.0918 1.0950 1.0950 1.0905 1.0936 1.0985 1.0985 1.1009
irintensity: 0.0000 0.0000 0.0000 0.0123 0.0123 0.0000 0.0000 9.5103 9.5104 0.0000 0.0000 35.7209 35.7208 0.0000 1.7400 0.0000 0.0000 0.0000 12.7118 12.7117 15.8954 15.8954 0.0000 0.0000 8.5246 8.5248 0.0000 0.0000 26.3069 0.0000 53.0308 0.0000 0.0000 0.0000 25.5091 25.5093 5.6879 0.0000 0.0000 0.8837 0.8837 0.0000 0.0000 0.0000 46.9160 49.1941 49.1940 0.0000
temp: 298.150 k
press: 1.00000 atm
elementType: 6 1 6 6 1 1 6 1 6 6 1 1 6 1 6 6 1 1
symmnumber: 3
zpe: 397083.4 jmol-1
zpe.correction: 0.151241 hartree
zpe.thermalcorrener: 0.157324 hartree
zpe.thermalcorrenthalpy: 0.158268 hartree
zpe.thermalcorrgfe: 0.122681 hartree
zpe.sumelectzpe: -347.501675 hartree
zpe.sumelectthermal: -347.495593 hartree
zpe.sumelectthermalent: -347.494648 hartree
zpe.sumelectthermalfe: -347.530235 hartree
dipole: 0.0000 0.0000 0.0000
dipole: 0.0000
quadrupole: -42.5062 -42.5062 -34.5593
quadrupole: 0.0000 0.0000 -0.0000
quadrupole: -2.6490 -2.6490 5.2979 0.0000 0.0000 -0.0000
hfenergy: -347.6529163 hartree
pointgroup: C03H [SGH(C3H3),X(C6H6)]
dipole: 0. 0. 0. debye
dipolederiv: -0.055614 -0.0000044 0. -0.0000079 -0.2612351 0. 0. 0. 0.2042568 0.0591151 0.000002 0. -0.0000017 0.1654165 0. 0. 0. 0.1166122 0.2630908 -0.0000022 -0.0000023 -0.000001 -0.106789 0.1688135 -0.0000056 0.2069426 -0.1052286 0.2630908 -0.0000022 0.0000023 -0.000001 -0.1067891 -0.1688135 0.0000056 -0.2069427 -0.1052286 0.1513636 0.0000006 0.0000003 -0.0000003 0.071825 0.0130282 0.0000014 -0.021007 0.1114616 0.1513636 0.0000006 -0.0000003 -0.0000003 0.071825 -0.0130282 -0.0000014 0.0210069 0.1114616 -0.2098275 0.0890355 0. 0.0890403 -0.1070216 0. 0. 0. 0.2042568 0.1388413 -0.046029 0. -0.0460305 0.0856902 0. 0. 0. 0.1166122 -0.0143172 0.1601643 0.1461959 0.1601633 0.170619 -0.0844083 0.1792178 -0.1034709 -0.1052286 -0.0143172 0.1601643 -0.1461959 0.1601633 0.170619 0.0844083 -0.1792178 0.103471 -0.1052286 0.0917097 0.0344416 0.0112829 0.034441 0.1314789 -0.0065138 -0.0181924 0.0105036 0.1114616 0.0917097 0.0344416 -0.0112829 0.034441 0.1314788 0.0065138 0.0181924 -0.0105036 0.1114616 -0.2098325 -0.0890349 0. -0.0890342 -0.1070141 0. 0. 0. 0.2042565 0.1388404 0.0460304 0. 0.0460278 0.0856907 0. 0. 0. 0.1166124 -0.0143201 -0.1601606 -0.1461921 -0.1601605 0.1706218 -0.0844043 -0.1792195 -0.1034759 -0.1052303 -0.0143201 -0.1601606 0.146192 -0.1601605 0.1706217 0.0844043 0.1792195 0.1034759 -0.1052303 0.0917105 -0.0344409 -0.0112823 -0.0344417 0.1314798 -0.0065138 0.0181931 0.0105045 0.1114622 0.0917105 -0.0344409 0.0112823 -0.0344417 0.1314798 0.0065138 -0.0181931 -0.0105045 0.1114622 unknown
polarizability: 79.0317058|0.0002478|79.0314194|0.|-0.0000002|87.6019579 unknown
InChI: InChI=1/9C.9H
charge 1 multiplicity 1
18 atoms
C  0.00000128 1.63517221 0.0000
H  -0.00000653 2.72679597 0.0000
C  0.00000252 0.9170562 1.20378848
C  0.00000252 0.9170562 -1.20378848
H  0.00000396 1.43455488 -2.16549925
H  0.00000396 1.43455488 2.16549925
C  1.41609979 -0.81758678 0.0000
H  2.3614776 -1.3633919 0.0000
C  0.79419246 -0.45852985 1.20378848
C  0.79419246 -0.45852985 -1.20378848
H  1.24235874 -0.71728044 -2.16549925
H  1.24235874 -0.71728044 2.16549925
C  -1.41610107 -0.81758457 0.0000
H  -2.36147107 -1.36340322 0.0000
C  -0.79419498 -0.45852549 1.20378848
C  -0.79419498 -0.45852549 -1.20378848
H  -1.2423627 -0.71727358 -2.16549925
H  -1.2423627 -0.71727358 2.16549925
