program: Gaussian 16
title: Title Card Required
version: ES64L-G16RevA.03
frameworkgroup: C2[C2(CH),X(C8H8)]
method: RB3LYP
basis: def2SVP
operation: Freq
keyword: #N
keyword: Geom=AllCheck
keyword: Guess=TCheck
keyword: SCRF=Check
keyword: GenChk
keyword: RB3LYP/def2SVP
keyword: Freq
converged: YES YES YES YES
title: Mulliken charges:
elementType: C H C C H H C H C C H H C H C C H H
charge: 0.068050 0.078999 0.031526 0.031526 0.090386 0.090386 0.103409 0.073660 0.051581 -0.070083 0.081662 0.064335 0.103409 0.073660 -0.070083 0.051581 0.064335 0.081662
chargesum: 1.00000
title: Mulliken charges with hydrogens summed into heavy atoms:
elementType: C C C C C C C C C
charge: 0.147049 0.121911 0.121911 0.177069 0.115916 0.011579 0.177069 0.011579 0.115916
1716.lowfreq: -0.0007 -0.0005 0.0005 5.3664 5.9417 11.8567 154.3263 232.5743 348.3804
frequency: 154.3247 232.5741 348.3804 373.6981 413.3692 470.7826 523.6066 607.7387 627.6950 726.1131 728.7828 734.1911 813.7540 843.1056 858.8626 888.3407 907.1807 943.4872 971.8002 974.6782 986.6222 993.4058 1040.0731 1050.6674 1139.4269 1152.3481 1171.1148 1181.3070 1194.7856 1213.8478 1297.8906 1311.8981 1356.1772 1378.4403 1383.6140 1489.7696 1551.8187 1646.5752 1673.9367 3154.2154 3154.7422 3177.9218 3192.3774 3196.1481 3206.2733 3206.3060 3229.8791 3231.4109
redmass: 3.8808 3.0882 3.2307 4.1882 2.6475 2.7237 6.0146 2.1702 5.6104 1.4316 1.7773 1.4766 2.8324 3.6912 2.4031 2.6165 3.0132 3.5064 1.4352 1.5192 1.5377 1.6107 1.9689 1.8006 1.0607 1.1598 1.3324 1.1691 1.1550 1.3153 1.3117 1.2922 2.0519 1.7821 1.4864 2.5596 4.4349 5.7437 6.4568 1.0904 1.0908 1.0873 1.0937 1.0985 1.0892 1.0900 1.1021 1.1036
irintensity: 65.3337 15.4322 1.5031 3.3934 16.0657 14.7659 1.6542 1.2211 5.7597 32.4814 74.7026 4.1577 11.6693 8.4097 7.1405 1.8090 19.1493 6.8400 10.0870 7.3650 0.4185 2.9713 4.5152 0.7634 0.1581 5.9040 2.6505 15.8114 6.9267 9.9979 1.2623 7.3550 3.8657 0.9425 26.7161 0.0130 74.9594 7.8521 4.6134 0.2537 0.0113 9.1909 7.7201 15.4528 2.2383 19.7031 18.8688 2.4964
temp: 298.150 k
press: 1.00000 atm
elementType: 6 1 6 6 1 1 6 1 6 6 1 1 6 1 6 6 1 1
symmnumber: 2
zpe: 395398.5 jmol-1
zpe.correction: 0.150599 hartree
zpe.thermalcorrener: 0.157385 hartree
zpe.thermalcorrenthalpy: 0.158329 hartree
zpe.thermalcorrgfe: 0.120711 hartree
zpe.sumelectzpe: -347.655824 hartree
zpe.sumelectthermal: -347.649038 hartree
zpe.sumelectthermalent: -347.648094 hartree
zpe.sumelectthermalfe: -347.685712 hartree
dipole: -0.0000 -0.0000 0.9295
dipole: 0.9295
quadrupole: -43.0615 -35.6866 -41.8696
quadrupole: 2.8700 0.0000 0.0000
quadrupole: -2.8556 4.5193 -1.6637 2.8700 0.0000 0.0000
hfenergy: -347.8064234 hartree
pointgroup: C02 [C2(C1H1),X(C8H8)]
dipole: 0. 0. 0.3656994 debye
dipolederiv: -0.2958983 -0.1081667 0. -0.5097434 -0.5819809 0. 0. 0. -0.1540665 0.0612787 -0.1183932 0. 0.0030661 0.1399802 0. 0. 0. 0.1402565 0.2998832 0.1487934 -0.1745982 0.1217023 0.2916232 0.0297103 -0.4198973 -0.1792068 0.4619118 0.2998832 0.1487934 0.1745982 0.1217023 0.2916232 -0.0297103 0.4198973 0.1792068 0.4619118 0.1425755 0.0341779 -0.0092134 -0.0188716 0.1001854 -0.0098079 0.016296 0.0241232 0.0864181 0.1425755 0.0341779 0.0092134 -0.0188716 0.1001854 0.0098079 -0.016296 -0.0241232 0.0864181 -0.0387538 0.0584465 -0.0246379 0.0305531 -0.0287443 -0.1111975 0.0056687 -0.0200218 -0.1683491 0.0705437 -0.0054544 -0.030211 -0.0056767 0.1109402 0.004409 0.0658735 0.005101 0.195142 -0.2241242 -0.107722 0.2676532 0.0589702 0.2020074 -0.1335726 -0.1003243 0.0393597 -0.0114981 0.1928342 -0.0220764 0.2017924 0.0427435 -0.0929865 0.0303835 -0.1072138 -0.0587423 -0.2272117 0.1036065 -0.0021849 -0.0185873 0.0355091 0.1064759 0.0479413 -0.074981 0.0209973 0.0815945 0.0707447 0.0092998 -0.0102209 -0.0115913 0.0314992 0.0143898 -0.0149462 0.0104559 0.0888975 -0.0387538 0.0584465 0.0246379 0.0305531 -0.0287443 0.1111975 -0.0056687 0.0200218 -0.1683491 0.0705437 -0.0054544 0.030211 -0.0056767 0.1109402 -0.004409 -0.0658735 -0.005101 0.195142 0.1928342 -0.0220764 -0.2017924 0.0427435 -0.0929865 -0.0303835 0.1072138 0.0587423 -0.2272117 -0.2241242 -0.107722 -0.2676532 0.0589702 0.2020074 0.1335726 0.1003243 -0.0393597 -0.0114981 0.0707447 0.0092998 0.0102209 -0.0115913 0.0314992 -0.0143898 0.0149462 -0.0104559 0.0888975 0.1036065 -0.0021849 0.0185873 0.0355091 0.1064759 -0.0479413 0.074981 -0.0209973 0.0815945 unknown
polarizability: 75.1753804|6.5694976|93.7323651|0.|0.|81.5268615 unknown
InChI: InChI=1/9C.9H
charge 1 multiplicity 1
18 atoms
C  0.0000 0.0000 1.76862876
H  0.0000 0.0000 2.86289119
C  0.34976582 1.16425051 1.0988081
C  -0.34976582 -1.16425051 1.0988081
H  -0.86704997 -1.9687801 1.6313426
H  0.86704997 1.9687801 1.6313426
C  -1.21741902 0.71013596 -0.85414011
H  -2.0149274 1.3203259 -1.28397859
C  0.01213603 1.39354559 -0.33540683
C  -1.29019626 -0.62556971 -0.81085232
H  -2.16592685 -1.21511701 -1.08621651
H  0.06720333 2.45447957 -0.60083581
C  1.21741902 -0.71013596 -0.85414011
H  2.0149274 -1.3203259 -1.28397859
C  1.29019626 0.62556971 -0.81085232
C  -0.01213603 -1.39354559 -0.33540683
H  -0.06720333 -2.45447957 -0.60083581
H  2.16592685 1.21511701 -1.08621651
