program: Gaussian 16
title: Title Card Required
version: ES64L-G16RevA.03
frameworkgroup: CS[SG(C3H3),X(C6H6)]
method: RCAM-B3LYP
basis: def2SVP
operation: Freq
keyword: #N
keyword: Geom=AllCheck
keyword: Guess=TCheck
keyword: SCRF=Check
keyword: GenChk
keyword: RCAM-B3LYP/def2SVPFreq
converged: YES YES YES YES
title: Mulliken charges:
elementType: C C C H H H C H C H C H C H C H C H
charge: -0.036745 -0.036745 -0.133863 0.095937 0.095937 0.100653 0.234867 0.084495 -0.002655 0.088733 -0.105386 0.096047 0.191253 0.072779 -0.105386 0.096047 0.191253 0.072779
chargesum: 1.00000
title: Mulliken charges with hydrogens summed into heavy atoms:
elementType: C C C C C C C C C
charge: 0.059192 0.059192 -0.033211 0.319361 0.086079 -0.009340 0.264033 -0.009340 0.264033
1716.lowfreq: -339.4241 -14.3563 -14.1539 -10.9445 -0.0010 -0.0007 -0.0006 284.6585 409.9299
frequency: -339.4241 284.6585 409.9299 480.3921 488.4325 506.2036 529.2850 600.1624 633.6015 674.6383 716.1736 763.9479 815.3270 846.0391 900.7129 914.1869 933.0552 939.5993 971.3087 983.9615 1016.4897 1018.0887 1075.4702 1084.9424 1100.5629 1122.9922 1144.5094 1148.6157 1171.0236 1177.0220 1252.2824 1311.5807 1323.2988 1433.0232 1443.9279 1455.5296 1521.3900 1612.4470 1626.6856 3213.3460 3225.5565 3229.6932 3237.5327 3238.2830 3240.5364 3251.4251 3253.6648 3256.0090
redmass: 6.9533 4.5157 4.3558 2.2748 2.2819 5.2011 7.0036 5.6881 2.2403 5.5698 3.3393 1.5129 1.6287 1.7082 2.2771 1.7800 2.5415 2.0380 1.7874 1.5312 1.6842 1.3337 1.6438 1.4813 1.2974 1.2954 1.1173 1.0894 1.0968 1.3676 2.0667 1.2369 1.2512 2.7262 2.0922 2.1144 3.0106 5.3844 5.9532 1.0937 1.0930 1.0929 1.0926 1.0925 1.0936 1.0998 1.1017 1.1006
irintensity: 24.0250 0.0328 0.1076 0.7738 0.6463 1.9512 5.0307 7.0430 1.4013 1.3369 6.1819 32.1746 28.7241 1.1598 10.5763 5.5717 1.7502 25.7687 1.5486 7.8811 20.9555 0.6404 8.6969 0.0106 0.0588 11.5884 0.6196 0.0006 5.5160 2.4455 42.4205 0.8007 0.9275 4.0711 32.5748 9.7699 16.1198 3.2278 0.1181 2.3912 0.1509 5.8725 24.2932 27.4174 23.0683 29.6086 16.5052 11.9149
temp: 298.150 k
press: 1.00000 atm
elementType: 6 6 6 1 1 1 6 1 6 1 6 1 6 1 6 1 6 1
symmnumber: 1
zpe: 398222.2 jmol-1
zpe.correction: 0.151675 hartree
zpe.thermalcorrener: 0.157495 hartree
zpe.thermalcorrenthalpy: 0.158439 hartree
zpe.thermalcorrgfe: 0.122110 hartree
zpe.sumelectzpe: -347.402261 hartree
zpe.sumelectthermal: -347.396441 hartree
zpe.sumelectthermalent: -347.395496 hartree
zpe.sumelectthermalfe: -347.431826 hartree
dipole: -0.4235 0.0966 0.0000
dipole: 0.4344
quadrupole: -41.6197 -35.8124 -43.7130
quadrupole: 2.1578 0.0000 -0.0000
quadrupole: -1.2380 4.5693 -3.3313 2.1578 0.0000 -0.0000
hfenergy: -347.5539359 hartree
pointgroup: CS [SG(C3H3),X(C6H6)]
dipole: -0.1668151 0.0371812 0. debye
dipolederiv: 0.2173597 -0.1951444 -0.0812372 -0.1363312 0.0543278 -0.0786261 -0.0894697 -0.0038218 0.0358919 0.2173597 -0.1951444 0.0812372 -0.1363312 0.0543278 0.0786261 0.0894697 0.0038218 0.0358919 -0.0522734 0.2352281 0. 0.289086 -0.3310728 0. 0. 0. 0.0573625 0.1216261 0.0163642 -0.0385054 -0.0230569 0.107017 -0.0013118 -0.0309846 0.0168019 0.0959867 0.1216261 0.0163642 0.0385054 -0.0230569 0.107017 0.0013118 0.0309846 -0.0168019 0.0959867 0.0813705 0.0075777 0. 0.0323747 0.1061462 0. 0. 0. 0.1408382 -0.0824778 0.0992259 0. 0.1795909 0.2614921 0. 0. 0. -0.0459152 0.1649143 -0.0156288 0. -0.0155048 0.1229978 0. 0. 0. 0.0869957 -0.5094018 -0.1213672 0. -0.133604 0.0617218 0. 0. 0. 0.1259379 0.0769577 0.0219957 0. -0.0034223 0.0865429 0. 0. 0. 0.1350898 0.2455929 -0.0167359 0.0974295 0.0362235 -0.0853721 0.1028391 -0.2184924 0.0434501 0.1364032 0.1391394 -0.0001561 -0.0099815 0.0050413 0.1212021 0.0359641 -0.0498634 0.004117 0.0778984 -0.1184956 0.100412 -0.0198829 -0.0635918 0.0278667 0.0411293 -0.1048468 0.0312415 -0.2552857 0.0552328 -0.0182555 0.0021581 0.0074549 0.1210444 0.0017428 0.0673968 0.0015865 0.158951 0.2455929 -0.0167359 -0.0974294 0.0362235 -0.0853721 -0.1028391 0.2184924 -0.0434501 0.1364031 0.1391394 -0.0001561 0.0099815 0.0050413 0.1212021 -0.0359641 0.0498634 -0.004117 0.0778984 -0.1184956 0.100412 0.0198829 -0.0635918 0.0278668 -0.0411293 0.1048468 -0.0312415 -0.2552857 0.0552328 -0.0182555 -0.0021581 0.0074549 0.1210444 -0.0017428 -0.0673968 -0.0015865 0.158951 unknown
polarizability: 78.7988274|2.6484645|87.69346|0.|0.|77.4269687 unknown
InChI: InChI=1/9C.9H
charge 1 multiplicity 1
18 atoms
C  0.05033192 -1.29654896 0.75676682
C  0.05033192 -1.29654896 -0.75676682
C  -1.30025841 -0.80827653 0.0000
H  -0.0662159 -2.27672732 1.2220385
H  -0.0662159 -2.27672732 -1.2220385
H  -2.12310184 -1.52314986 0.0000
C  -1.51733317 0.55162776 0.0000
H  -2.52941886 0.96010685 0.0000
C  -0.38330727 1.42563952 0.0000
H  -0.57351914 2.50086894 0.0000
C  0.76464726 0.99540336 0.93252419
H  1.39557879 1.79503149 1.32127423
C  0.77096974 -0.27566772 1.43515218
H  1.34838253 -0.52132919 2.32733745
C  0.76464726 0.99540336 -0.93252419
H  1.39557879 1.79503149 -1.32127423
C  0.77096974 -0.27566772 -1.43515218
H  1.34838253 -0.52132919 -2.32733745
