program: Gaussian 16
title: Title Card Required
version: ES64L-G16RevA.03
frameworkgroup: CS[SG(C3H3),X(C6H6)]
method: RMN12SX
basis: def2SVP
operation: Freq
keyword: #N
keyword: Geom=AllCheck
keyword: Guess=TCheck
keyword: SCRF=Check
keyword: GenChk
keyword: RMN12SX/def2SVP
keyword: Freq
converged: YES YES YES YES
title: Mulliken charges:
elementType: C C C H H H C H C H C H C H C H C H
charge: -0.065611 -0.065611 -0.219337 0.143421 0.143421 0.149070 0.285636 0.148648 -0.271909 0.123449 -0.039599 0.126483 0.107493 0.120033 -0.039599 0.126483 0.107493 0.120033
chargesum: 1.00000
title: Mulliken charges with hydrogens summed into heavy atoms:
elementType: C C C C C C C C C
charge: 0.077810 0.077810 -0.070267 0.434284 -0.148459 0.086885 0.227526 0.086885 0.227526
1716.lowfreq: -10.9688 -5.7750 -0.0004 -0.0004 0.0006 6.6417 250.5743 268.0868 345.9683
frequency: 250.5740 268.0867 345.9683 414.0712 449.1949 513.4360 529.0172 570.6525 616.5583 672.7639 747.7568 760.7346 785.5467 872.3890 892.1039 899.4159 920.3315 927.1350 958.6453 966.2133 1009.3596 1036.5503 1052.3468 1060.0513 1106.7641 1149.4344 1156.8411 1166.7844 1190.9628 1225.0413 1303.8792 1312.1165 1329.6020 1406.4205 1417.8718 1429.0865 1574.5291 1695.0809 1702.9510 3155.3033 3175.1964 3180.0492 3186.4078 3198.8103 3200.1933 3220.1302 3220.8291 3226.3554
redmass: 3.9425 3.4490 3.4433 2.7228 2.9528 4.2484 4.9150 5.5270 2.5181 3.2552 1.5853 1.6597 2.0913 2.9543 1.9775 2.1126 2.4820 3.0535 1.4419 1.3995 1.8153 1.5626 1.8873 1.4689 1.2444 1.1509 1.0738 1.1172 1.1880 1.3517 1.2523 1.3831 1.5885 1.7731 3.4959 1.8895 4.1316 6.3424 6.8969 1.0913 1.0917 1.0937 1.0940 1.0886 1.0895 1.1039 1.1034 1.1002
irintensity: 14.5508 11.0199 9.8104 0.2124 5.6801 7.4587 11.4019 4.2705 3.2019 5.1834 46.8865 76.2766 1.8820 2.2282 1.0416 7.4209 42.9579 11.6250 7.7835 0.5791 8.8732 2.4735 12.8313 0.1650 0.0425 10.7152 0.4911 1.4695 0.1989 12.1866 2.0453 6.9259 36.9193 30.0184 8.5831 0.6316 23.2250 12.1286 1.2309 0.8915 3.6949 13.7699 32.9176 24.6347 29.5254 21.5724 38.1723 16.4952
temp: 298.150 k
press: 1.00000 atm
elementType: 6 6 6 1 1 1 6 1 6 1 6 1 6 1 6 1 6 1
symmnumber: 1
zpe: 397456.5 jmol-1
zpe.correction: 0.151383 hartree
zpe.thermalcorrener: 0.157884 hartree
zpe.thermalcorrenthalpy: 0.158828 hartree
zpe.thermalcorrgfe: 0.121293 hartree
zpe.sumelectzpe: -347.279832 hartree
zpe.sumelectthermal: -347.273331 hartree
zpe.sumelectthermalent: -347.272387 hartree
zpe.sumelectthermalfe: -347.309923 hartree
dipole: -1.2576 -0.2453 0.0000
dipole: 1.2813
quadrupole: -42.0186 -36.0568 -44.6056
quadrupole: 1.6983 0.0000 0.0000
quadrupole: -1.1249 4.8369 -3.7120 1.6983 0.0000 0.0000
hfenergy: -347.4312151 hartree
pointgroup: CS [SG(C3H3),X(C6H6)]
dipole: -0.4954565 -0.0930132 0. debye
dipolederiv: 0.3833967 -0.2199412 0.190624 -0.1080987 0.1580083 -0.0340032 -0.0287036 0.1242781 0.1636093 0.3833967 -0.2199412 -0.1906239 -0.1080987 0.1580083 0.0340032 0.0287036 -0.1242781 0.1636093 -0.2506435 0.3351076 0. 0.4543355 -0.5281768 0. 0. 0. -0.2669049 0.0870254 0.0407968 -0.0363711 -0.0262268 0.1189917 -0.0196766 -0.0300798 -0.0039577 0.0988578 0.0870254 0.0407968 0.0363711 -0.0262268 0.1189917 0.0196766 0.0300798 0.0039577 0.0988578 0.1068727 0.0370048 0. 0.0525713 0.1106494 0. 0. 0. 0.1412065 0.0910093 0.1099107 0. 0.0347671 0.448329 0. 0. 0. -0.046326 0.1801291 -0.0373813 0. -0.0400478 0.1352234 0. 0. 0. 0.1668879 -0.5193054 -0.2397021 0. -0.0319905 0.1575618 0. 0. 0. -0.1228154 0.0655746 0.0117261 0. 0.0017613 0.0666932 0. 0. 0. 0.08728 0.1414611 0.0705932 0.2353777 -0.0628064 -0.0580444 -0.1022036 0.0360703 -0.1397447 0.2282523 0.1538897 0.0066625 -0.0067557 0.0255317 0.1363594 0.0479032 -0.0609103 0.0149204 0.0788913 -0.1856214 0.0388567 0.024868 -0.043625 -0.1675922 0.0642664 -0.065593 0.0576395 -0.2410789 0.0830302 -0.0453009 -0.0333822 -0.0204733 0.1171372 -0.0058021 0.0476779 0.0087544 0.1918041 0.1414611 0.0705932 -0.2353777 -0.0628064 -0.0580444 0.1022036 -0.0360703 0.1397447 0.2282523 0.1538896 0.0066625 0.0067557 0.0255317 0.1363594 -0.0479032 0.0609103 -0.0149204 0.0788913 -0.1856214 0.0388567 -0.024868 -0.043625 -0.1675922 -0.0642664 0.065593 -0.0576395 -0.2410789 0.0830302 -0.0453009 0.0333822 -0.0204733 0.1171373 0.0058021 -0.0476779 -0.0087544 0.1918041 unknown
polarizability: 76.1374828|3.4032253|93.8338729|0.|0.0000002|76.7573641 unknown
InChI: InChI=1/9C.9H
charge 1 multiplicity 1
18 atoms
C  -0.03071654 -1.30177323 0.73413036
C  -0.03071654 -1.30177323 -0.73413036
C  -1.35582163 -0.71132413 0.0000
H  -0.26842972 -2.26196899 1.21175823
H  -0.26842972 -2.26196899 -1.21175823
H  -2.2458751 -1.34815865 0.0000
C  -1.42005833 0.65329977 0.0000
H  -2.38762694 1.17510193 0.0000
C  -0.16638554 1.4196892 0.0000
H  -0.32506915 2.50734587 0.0000
C  0.74863474 0.96303606 1.14216291
H  1.40522264 1.71729093 1.59087447
C  0.73952699 -0.32656078 1.49426159
H  1.33845974 -0.69618597 2.33475332
C  0.74863474 0.96303606 -1.14216291
H  1.40522264 1.71729093 -1.59087447
C  0.73952699 -0.32656078 -1.49426159
H  1.33845974 -0.69618597 -2.33475332
