program: Gaussian 16
title: Title Card Required
version: ES64L-G16RevA.03
frameworkgroup: C2[C2(CH),X(C8H8)]
method: RPW6B95D3
basis: def2SVP
operation: Freq
keyword: #N
keyword: Geom=AllCheck
keyword: Guess=TCheck
keyword: SCRF=Check
keyword: GenChk
keyword: RPW6B95D3/def2SVP
keyword: Freq
converged: YES YES YES YES
title: Mulliken charges:
elementType: C H C C H H C H C C H H C H C C H H
charge: 0.109942 0.082365 -0.002393 -0.002393 0.094808 0.094808 0.177263 0.077541 -0.019985 -0.095491 0.091362 0.080741 0.177263 0.077541 -0.095491 -0.019985 0.080741 0.091362
chargesum: 1.00000
title: Mulliken charges with hydrogens summed into heavy atoms:
elementType: C C C C C C C C C
charge: 0.192307 0.092415 0.092415 0.254805 0.060756 -0.004129 0.254805 -0.004129 0.060756
1716.lowfreq: -225.1075 -11.5391 -0.0005 -0.0004 0.0007 17.0527 27.0171 139.6302 344.3475
frequency: -225.0967 139.6287 344.3443 389.9738 439.3362 470.4630 516.4676 624.5938 630.9568 716.8859 733.7510 764.8820 820.0118 859.5977 884.5360 885.2465 919.2623 939.6510 973.5246 984.4975 993.2512 997.4473 1063.0832 1064.6350 1138.2189 1158.5770 1165.1528 1173.3037 1181.3066 1189.3982 1308.4034 1313.4824 1348.9984 1405.1492 1405.4731 1490.4949 1557.7362 1656.3524 1681.4153 3200.6831 3201.0952 3221.0911 3237.3296 3240.5421 3244.8323 3245.0097 3266.1253 3267.5911
redmass: 4.9123 4.2736 3.2748 4.7202 2.5787 2.4972 6.5158 5.7452 2.3251 1.3171 1.9094 1.4685 3.0970 2.8249 2.4498 2.4030 2.9679 2.7749 1.4287 1.4196 1.4774 1.6260 1.6165 1.7772 1.1204 1.1288 1.1777 1.3698 1.1050 1.2865 1.2963 1.2626 1.9923 1.8084 2.1204 2.7408 4.3978 5.9249 6.3983 1.0914 1.0916 1.0876 1.0945 1.0996 1.0904 1.0897 1.1023 1.1036
irintensity: 73.5052 20.7366 0.2380 2.3869 8.6758 10.5329 0.0013 3.0980 0.8969 37.8839 51.3948 0.7234 5.6364 20.1956 2.8581 9.1199 23.3793 3.7088 9.1258 2.0111 2.7593 0.1464 1.7626 2.8652 1.5498 4.7865 10.0301 6.9511 5.2412 3.0798 1.0637 3.3432 19.8486 19.3689 1.5005 0.0111 56.5744 7.6143 7.4360 1.2071 0.0489 16.0179 10.8625 20.6896 26.1163 2.0896 24.1785 2.3396
temp: 298.150 k
press: 1.00000 atm
elementType: 6 1 6 6 1 1 6 1 6 6 1 1 6 1 6 6 1 1
symmnumber: 2
zpe: 397481.9 jmol-1
zpe.correction: 0.151393 hartree
zpe.thermalcorrener: 0.157624 hartree
zpe.thermalcorrenthalpy: 0.158568 hartree
zpe.thermalcorrgfe: 0.121890 hartree
zpe.sumelectzpe: -348.088886 hartree
zpe.sumelectthermal: -348.082655 hartree
zpe.sumelectthermalent: -348.081711 hartree
zpe.sumelectthermalfe: -348.118389 hartree
dipole: 0.0000 0.0000 0.4656
dipole: 0.4656
quadrupole: -41.7366 -35.8120 -42.3615
quadrupole: 3.2402 -0.0000 0.0000
quadrupole: -1.7665 4.1580 -2.3915 3.2402 -0.0000 0.0000
hfenergy: -348.240279 hartree
pointgroup: C02 [C2(C1H1),X(C8H8)]
dipole: 0. 0. 0.1831697 debye
dipolederiv: -0.299699 -0.0507248 0. -0.4677394 -0.4139816 0. 0. 0. -0.2554244 0.0415046 -0.1061968 0. 0.014132 0.1500308 0. 0. 0. 0.1651464 0.339494 0.0969535 -0.1566891 0.0699751 0.1890658 0.0494182 -0.4266343 -0.1140105 0.4399622 0.339494 0.0969535 0.1566891 0.0699751 0.1890658 -0.0494182 0.4266342 0.1140105 0.4399622 0.1438675 0.0263339 -0.0272583 -0.0208581 0.1086134 -0.0103757 0.0142147 0.0193475 0.0816982 0.1438675 0.0263339 0.0272583 -0.0208581 0.1086133 0.0103757 -0.0142147 -0.0193475 0.0816982 -0.0437131 0.075068 -0.0301813 0.0337703 0.0045779 -0.1183164 -0.0360198 -0.0155592 -0.1675889 0.0863241 -0.0096623 -0.0145808 -0.0073319 0.1155576 0.0035753 0.0711922 -0.0002097 0.1784231 -0.2614695 -0.0992974 0.1636778 0.0433677 0.1587386 -0.0831806 -0.1135323 0.0466542 0.0392181 0.1831254 -0.0285406 0.1581659 0.0843256 -0.1085452 0.0969168 -0.1776902 -0.0259604 -0.2278634 0.1033515 0.0040163 -0.0178196 0.0352796 0.1070937 0.0409131 -0.0581525 0.0202472 0.0976805 0.0781172 0.0135895 -0.0110715 -0.0117247 0.0568735 0.0114433 -0.0193822 0.0123853 0.1036094 -0.0437131 0.0750679 0.0301813 0.0337703 0.0045779 0.1183164 0.0360198 0.0155593 -0.1675889 0.0863241 -0.0096623 0.0145808 -0.0073319 0.1155576 -0.0035753 -0.0711923 0.0002097 0.1784231 0.1831254 -0.0285406 -0.1581659 0.0843256 -0.1085452 -0.0969169 0.1776902 0.0259604 -0.2278634 -0.2614695 -0.0992974 -0.1636778 0.0433677 0.1587386 0.0831806 0.1135323 -0.0466542 0.039218 0.0781172 0.0135895 0.0110715 -0.0117247 0.0568735 -0.0114433 0.0193822 -0.0123853 0.1036094 0.1033515 0.0040163 0.0178196 0.0352796 0.1070937 -0.0409131 0.0581525 -0.0202472 0.0976805 unknown
polarizability: 76.4109229|6.2818592|90.2981705|0.|0.|79.4085405 unknown
InChI: InChI=1/9C.9H
charge 1 multiplicity 1
18 atoms
C  0.0000 0.0000 1.72220843
H  0.0000 0.0000 2.81184361
C  0.40585165 1.13564516 1.04721404
C  -0.40585165 -1.13564516 1.04721404
H  -0.97572736 -1.91637789 1.55062351
H  0.97572736 1.91637789 1.55062351
C  -1.22061376 0.6958629 -0.83253898
H  -2.03900386 1.27561103 -1.25445417
C  -0.01641479 1.39656535 -0.354695
C  -1.27996276 -0.64089311 -0.74499115
H  -2.1592701 -1.23390036 -0.98381422
H  0.03530046 2.45272936 -0.61988954
C  1.22061376 -0.6958629 -0.83253898
H  2.03900386 -1.27561103 -1.25445417
C  1.27996276 0.64089311 -0.74499115
C  0.01641479 -1.39656535 -0.354695
H  -0.03530046 -2.45272936 -0.61988954
H  2.1592701 1.23390036 -0.98381422
