program: Gaussian 16
title: Title Card Required
version: ES64L-G16RevA.03
frameworkgroup: C3H[SGH(C3H3),X(C6H6)]
method: RtHCTHhyb
basis: def2SVP
operation: Freq
keyword: #N
keyword: Geom=AllCheck
keyword: Guess=TCheck
keyword: SCRF=Check
keyword: GenChk
keyword: RtHCTHhyb/def2SVP
keyword: Freq
converged: YES YES YES YES
title: Mulliken charges:
elementType: C H C C H H C H C C H H C H C C H H
charge: 0.236142 0.091124 -0.110607 -0.110607 0.113640 0.113640 0.236142 0.091124 -0.110607 -0.110607 0.113640 0.113640 0.236142 0.091124 -0.110607 -0.110607 0.113640 0.113640
chargesum: 1.00000
title: Mulliken charges with hydrogens summed into heavy atoms:
elementType: C C C C C C C C C
charge: 0.327266 0.003034 0.003034 0.327266 0.003034 0.003034 0.327266 0.003034 0.003034
chargesum: 1.00003
1716.lowfreq: -0.0204 -0.0204 -0.0073 4.8425 11.9890 11.9890 330.9428 330.9428 372.8582
frequency: 330.9426 330.9426 372.8582 482.5520 482.5520 537.2264 537.2264 543.3549 543.3549 589.8646 656.2973 772.5751 772.5751 828.2950 867.2179 883.5920 925.6817 925.6817 935.0056 935.0056 985.1432 985.1432 1057.1770 1063.0594 1082.7890 1082.7890 1120.3697 1120.3697 1142.6847 1151.3556 1180.0583 1290.0818 1290.0818 1398.3192 1426.7746 1426.7746 1448.1795 1550.6055 1550.6055 3192.4380 3192.4380 3197.4649 3197.4649 3197.8699 3202.3179 3209.3392 3209.3392 3213.2825
redmass: 8.4248 8.4248 3.4246 1.9426 1.9426 6.9170 6.9170 9.0627 9.0627 1.9350 6.2819 1.6618 1.6618 1.6809 2.8242 5.4459 1.0772 1.0772 3.2116 3.2116 1.3990 1.3990 1.2762 1.2639 1.5074 1.5074 1.0796 1.0796 1.3252 1.4598 1.5279 1.2217 1.2217 2.6810 2.0796 2.0796 2.5310 5.3414 5.3414 1.0910 1.0910 1.0947 1.0947 1.0898 1.0933 1.0986 1.0986 1.1010
irintensity: 0.0000 0.0000 0.0000 0.2986 0.2989 0.0000 0.0000 9.7766 9.7757 0.0000 0.0000 29.9761 29.9636 0.0000 0.9960 0.0000 0.0000 0.0000 13.5894 13.5883 15.6303 15.6293 0.0000 0.0000 9.3123 9.3123 0.0000 0.0000 30.3279 0.0000 45.7602 0.0000 0.0000 0.0000 22.3157 22.3152 6.2391 0.0000 0.0000 2.1150 2.1167 0.0000 0.0000 0.0000 37.5150 41.4262 41.4289 0.0000
temp: 298.150 k
press: 1.00000 atm
elementType: 6 1 6 6 1 1 6 1 6 6 1 1 6 1 6 6 1 1
symmnumber: 3
zpe: 391281.3 jmol-1
zpe.correction: 0.149031 hartree
zpe.thermalcorrener: 0.155430 hartree
zpe.thermalcorrenthalpy: 0.156375 hartree
zpe.thermalcorrgfe: 0.120238 hartree
zpe.sumelectzpe: -347.574760 hartree
zpe.sumelectthermal: -347.568361 hartree
zpe.sumelectthermalent: -347.567417 hartree
zpe.sumelectthermalfe: -347.603553 hartree
dipole: 0.0000 -0.0000 0.0000
dipole: 0.0000
quadrupole: -42.6398 -42.6398 -34.7517
quadrupole: 0.0000 0.0000 0.0000
quadrupole: -2.6294 -2.6294 5.2587 0.0000 0.0000 0.0000
hfenergy: -347.7237912 hartree
pointgroup: C03H [SGH(C3H3),X(C6H6)]
dipole: 0. 0. 0. debye
dipolederiv: -0.0534119 -0.000018 0. 0.0000182 -0.2483485 0. 0. 0. 0.1993564 0.0598466 0.0000042 0. -0.0000074 0.1551123 0. 0. 0. 0.1137697 0.2554385 -0.000003 -0.0000186 -0.0000474 -0.0917813 0.1717936 -0.0000176 0.2039711 -0.09301 0.2554385 -0.000003 0.0000186 -0.0000474 -0.0917813 -0.1717936 0.0000176 -0.2039711 -0.09301 0.147721 0.0000169 -0.0000279 0.0000076 0.0653887 0.0165814 -0.0000053 -0.0182984 0.1031154 0.1477209 0.0000169 0.0000279 0.0000076 0.0653887 -0.0165814 0.0000053 0.0182984 0.1031154 -0.1996158 0.0844143 0. 0.0844039 -0.1021445 0. 0. 0. 0.1993564 0.1313003 -0.0412538 0. -0.0412437 0.0836587 0. 0. 0. 0.1137697 -0.0049692 0.1503529 0.148774 0.1503565 0.1686264 -0.0859032 0.1766445 -0.101985 -0.0930099 -0.0049692 0.1503529 -0.148774 0.1503565 0.1686264 0.0859032 -0.1766445 0.101985 -0.0930099 0.0859712 0.0356523 0.0143611 0.0356488 0.1271385 -0.0082886 -0.0158467 0.0091494 0.1031154 0.0859712 0.0356523 -0.0143611 0.0356488 0.1271385 0.0082886 0.0158467 -0.0091494 0.1031154 -0.1995954 -0.0844084 0. -0.0843955 -0.1021386 0. 0. 0. 0.1993617 0.1312795 0.0412548 0. 0.0412541 0.0836506 0. 0. 0. 0.1137553 -0.005008 -0.15033 -0.1487968 -0.1503504 0.1686286 -0.0859143 -0.1766013 -0.1019713 -0.0930322 -0.005008 -0.15033 0.1487968 -0.1503504 0.1686286 0.0859143 0.1766013 0.1019713 -0.0930322 0.0859696 -0.0356546 -0.0143486 -0.035661 0.1271287 -0.0083017 0.0158521 0.009149 0.1031395 0.0859696 -0.0356546 0.0143486 -0.035661 0.1271287 0.0083017 -0.0158521 -0.009149 0.1031395 unknown
polarizability: 80.1082813|0.0001443|80.1081147|0.|0.|89.2326632 unknown
InChI: InChI=1/9C.9H
charge 1 multiplicity 1
18 atoms
C  -0.00000676 1.64399582 0.0000
H  -0.00001236 2.7372968 0.0000
C  0.00001107 0.92497765 1.20838069
C  0.00001107 0.92497765 -1.20838069
H  0.00000856 1.44122908 -2.17247169
H  0.00000856 1.44122908 2.17247169
C  1.42374528 -0.82199162 0.0000
H  2.3705745 -1.36863727 0.0000
C  0.80104837 -0.46249798 1.20838069
C  0.80104837 -0.46249798 -1.20838069
H  1.24813647 -0.72062153 -2.17247169
H  1.24813647 -0.72062153 2.17247169
C  -1.42373851 -0.82200334 0.0000
H  -2.37056214 -1.36865867 0.0000
C  -0.80105943 -0.46247882 1.20838069
C  -0.80105943 -0.46247882 -1.20838069
H  -1.24814503 -0.7206067 -2.17247169
H  -1.24814503 -0.7206067 2.17247169
