program: Gaussian 16
title: Title Card Required
version: ES64L-G16RevA.03
frameworkgroup: C3H[SGH(C3H3),X(C6H6)]
method: RwB97X
basis: def2SVP
operation: Freq
keyword: #N
keyword: Geom=AllCheck
keyword: Guess=TCheck
keyword: SCRF=Check
keyword: GenChk
keyword: RwB97X/def2SVP
keyword: Freq
converged: YES YES YES YES
title: Mulliken charges:
elementType: C H C C H H C H C C H H C H C C H H
charge: 0.224453 0.098200 -0.113798 -0.113798 0.119138 0.119138 0.224453 0.098200 -0.113798 -0.113798 0.119138 0.119138 0.224453 0.098200 -0.113798 -0.113798 0.119138 0.119138
chargesum: 1.00000
title: Mulliken charges with hydrogens summed into heavy atoms:
elementType: C C C C C C C C C
charge: 0.322653 0.005340 0.005340 0.322653 0.005340 0.005340 0.322653 0.005340 0.005340
chargesum: 0.99995
1716.lowfreq: -10.0258 -0.0360 -0.0360 -0.0259 18.3667 18.3667 384.1564 427.9824 427.9824
frequency: 384.1564 427.9823 427.9823 498.0345 498.0345 563.4869 563.4869 601.8594 601.8594 614.8965 671.3134 805.1372 805.1372 866.0546 899.3639 918.3679 946.5457 946.5457 967.8581 967.8581 1032.8695 1032.8695 1086.6147 1095.5690 1105.2630 1105.2630 1137.2992 1137.2992 1149.5087 1179.7060 1198.8477 1315.7664 1315.7664 1456.9520 1468.0270 1468.0270 1482.6203 1608.0265 1608.0265 3244.9484 3244.9484 3250.1366 3250.2035 3250.2035 3255.1759 3261.0336 3261.0336 3265.1903
redmass: 3.3999 8.2294 8.2294 1.9872 1.9872 6.7557 6.7557 6.5206 6.5206 1.9747 6.2705 1.6337 1.6337 1.6079 2.7202 5.3972 1.0792 1.0792 3.1925 3.1925 1.4648 1.4648 1.2797 1.2926 1.4603 1.4603 1.0746 1.0746 1.5397 1.3483 1.3361 1.2275 1.2275 3.1588 2.2220 2.2220 2.5386 5.4700 5.4700 1.0917 1.0917 1.0910 1.0961 1.0961 1.0946 1.1005 1.1005 1.1024
irintensity: 0.0000 0.0000 0.0000 0.4590 0.4591 0.0000 0.0000 15.1361 15.1349 0.0000 0.0000 38.8408 38.8348 0.0000 0.9678 0.0000 0.0000 0.0000 16.1792 16.1703 9.9181 9.9144 0.0001 0.0000 9.4597 9.4589 0.0000 0.0000 50.5866 0.0000 36.1993 0.0000 0.0000 0.0000 32.1897 32.1801 4.9518 0.0000 0.0000 3.2993 3.3002 0.0000 0.0000 0.0000 46.1347 42.0658 42.0431 0.0000
temp: 298.150 k
press: 1.00000 atm
elementType: 6 1 6 6 1 1 6 1 6 6 1 1 6 1 6 6 1 1
symmnumber: 3
zpe: 402203.4 jmol-1
zpe.correction: 0.153191 hartree
zpe.thermalcorrener: 0.159130 hartree
zpe.thermalcorrenthalpy: 0.160074 hartree
zpe.thermalcorrgfe: 0.124705 hartree
zpe.sumelectzpe: -347.526699 hartree
zpe.sumelectthermal: -347.520760 hartree
zpe.sumelectthermalent: -347.519816 hartree
zpe.sumelectthermalfe: -347.555186 hartree
dipole: 0.0000 0.0000 0.0000
dipole: 0.0000
quadrupole: -42.7958 -42.7958 -34.9395
quadrupole: -0.0000 0.0000 0.0000
quadrupole: -2.6188 -2.6188 5.2375 -0.0000 0.0000 0.0000
hfenergy: -347.6798905 hartree
pointgroup: C03H [SGH(C3H3),X(C6H6)]
dipole: 0. 0. 0. debye
dipolederiv: -0.0638041 0.0000254 0. -0.0000833 -0.252214 0. 0. 0. 0.2324257 0.0470064 -0.0000058 0. 0.0000463 0.1594275 0. 0. 0. 0.1171386 0.3058771 -0.0000476 -0.0000061 0.0001761 -0.1431977 0.1856814 0.0001127 0.2537984 -0.1177783 0.3058771 -0.0000476 0.0000061 0.0001761 -0.1431974 -0.1856815 -0.0001127 -0.2537984 -0.1177782 0.1530003 -0.0000301 0.0000436 -0.0000327 0.0723824 0.0117062 0.0000556 -0.0172979 0.1096803 0.1530003 -0.0000301 -0.0000436 -0.0000327 0.0723825 -0.0117062 -0.0000556 0.017298 0.1096803 -0.2051059 0.0815804 0. 0.0815935 -0.1109122 0. 0. 0. 0.2324257 0.1313203 -0.048678 0. -0.0486838 0.0751136 0. 0. 0. 0.1171386 -0.0309218 0.1944592 0.1608075 0.1944594 0.1936014 -0.0928363 0.2197995 -0.1268933 -0.1177783 -0.0309217 0.1944591 -0.1608073 0.1944594 0.1936014 0.0928364 -0.2197995 0.1268931 -0.1177783 0.0925378 0.034911 0.0101398 0.0349071 0.132845 -0.0058497 -0.0149807 0.0086486 0.1096804 0.0925378 0.034911 -0.0101399 0.0349071 0.1328449 0.0058497 0.0149807 -0.0086485 0.1096803 -0.205104 -0.0815215 0. -0.0815694 -0.1109027 0. 0. 0. 0.2324914 0.1312727 0.0485963 0. 0.0486191 0.0751198 0. 0. 0. 0.1171784 -0.030905 -0.1945536 -0.1606882 -0.1944412 0.1936164 -0.0927797 -0.2199675 -0.1269373 -0.1178498 -0.030905 -0.1945535 0.160688 -0.1944412 0.1936164 0.0927798 0.2199675 0.1269371 -0.1178498 0.0925716 -0.0348819 -0.0101203 -0.0348853 0.1328891 -0.00582 0.0149825 0.0086826 0.1096728 0.0925716 -0.0348818 0.0101204 -0.0348853 0.1328891 0.00582 -0.0149825 -0.0086825 0.1096728 unknown
polarizability: 78.9076998|0.0009222|78.9066353|0.|0.0000002|86.636436 unknown
InChI: InChI=1/9C.9H
charge 1 multiplicity 1
18 atoms
C  0.00001393 1.63116591 0.0000
H  0.00000387 2.7228653 0.0000
C  0.00001251 0.91570913 1.20230658
C  0.00001251 0.91570913 -1.20230658
H  -0.00001958 1.43367646 -2.16356712
H  -0.00001958 1.43367646 2.16356712
C  1.4126239 -0.81559459 0.0000
H  2.35806833 -1.36143557 0.0000
C  0.79302087 -0.45786497 1.20230658
C  0.79302087 -0.45786497 -1.20230658
H  1.24160978 -0.71682084 -2.16356712
H  1.24160978 -0.71682084 2.16356712
C  -1.41263783 -0.81557046 0.0000
H  -2.35807221 -1.36142887 0.0000
C  -0.79303337 -0.45784331 1.20230658
C  -0.79303337 -0.45784331 -1.20230658
H  -1.24159019 -0.71685476 -2.16356712
H  -1.24159019 -0.71685476 2.16356712
