program: Gaussian 09
title: 000051673
version: EM64L-G09RevD.01
frameworkgroup: C1[X(C10H21O4PS2)]
method: RPBEPBE
basis: SDD
operation: Freq
keyword: #p
keyword: freq=noraman
keyword: PBEPBE/SDD
title: #p freq=noraman PBEPBE/SDD
converged: YES YES NO NO
title: Mulliken charges:
elementType: S S P O O O O C C C C C C C C C C H H H H H H H H H H H H H H H H H H H H H
charge: 0.008412 0.201560 0.974728 -0.513322 -0.629661 -0.264006 -0.247353 -0.351531 -0.336849 -0.279001 -0.342511 -0.693256 -0.865018 -0.853081 -0.829076 0.372720 -0.506481 0.213845 0.193582 0.188883 0.214387 0.216646 0.229527 0.192916 0.188707 0.211666 0.213203 0.212991 0.279411 0.279714 0.274550 0.320237 0.354068 0.285934 0.360135 0.234854 0.244833 0.243637
chargesum: 0.00000
title: Mulliken charges with hydrogens summed into heavy atoms:
elementType: S S P O O O O C C C C C C C C C C
charge: 0.008412 0.201560 0.974728 -0.513322 -0.629661 -0.264006 -0.247353 0.055896 0.066421 0.167173 0.039112 -0.055397 -0.031344 -0.178775 -0.183007 0.372720 0.216842
polarizability: 2.18737178e+02 -1.47021469e+01 1.84430348e+02 -2.11276185e+00 8.87037353e+00 1.58859088e+02
1716.lowfreq: -5.7147 -0.0027 -0.0006 0.0006 2.2576 6.9822 12.3555 21.5048 26.0022
frequency: 9.6398 21.2968 25.0309 37.1272 50.0394 54.8630 56.1615 67.3060 86.7072 103.1582 106.5227 115.3717 136.8965 143.9361 163.0477 166.8766 185.1648 204.3736 204.7443 232.1401 236.0952 240.7795 257.3887 287.9602 295.7030 320.9232 378.4871 395.2825 399.9563 404.8526 464.1950 556.8614 604.5651 624.3256 646.3485 662.4782 711.0181 724.0502 727.1170 780.2032 795.1291 803.8249 851.0090 882.2252 918.3563 932.3680 935.3914 941.6145 964.3868 970.0291 1021.0396 1026.0304 1058.9589 1087.7921 1107.3243 1111.9889 1117.2610 1140.2635 1147.7300 1154.4467 1211.0176 1228.7301 1232.8275 1252.1178 1276.1766 1276.8017 1285.5680 1294.9669 1338.4541 1339.7152 1359.2286 1366.4933 1387.3922 1390.8225 1420.7046 1429.3358 1433.7010 1444.5942 1445.6495 1452.1827 1463.1156 1464.1494 1467.2949 1475.3656 1477.4903 1487.2461 1633.7974 2960.3796 2969.2603 2973.9581 2977.1318 2991.4047 2995.2570 3003.8307 3005.8974 3021.1421 3023.9042 3050.2006 3063.2279 3070.7793 3071.7469 3072.0923 3108.6150 3126.7967 3145.8567 3151.7191 3153.8009 3154.3415
redmass: 4.3489 5.8083 4.5123 4.3265 2.1378 3.8677 5.1014 4.5968 4.2459 1.2041 2.6485 2.6413 4.8920 4.6328 1.8973 1.2818 2.9062 4.3753 3.8166 1.4510 2.5101 3.9533 6.8885 3.7926 4.7340 5.2227 3.5675 3.5023 4.1609 4.6663 2.9040 5.3713 6.9676 4.7292 7.5163 6.1808 2.7365 1.4026 5.7425 1.3462 1.5624 5.1713 1.6763 2.5729 1.8105 1.7744 1.9328 1.6089 1.4490 5.9386 2.3374 3.5247 2.5219 2.0344 1.7707 1.2686 2.2140 1.9452 1.4284 1.1019 1.3740 1.1081 1.2228 1.5353 1.2935 1.2267 1.1858 1.0722 1.4128 1.1757 1.3043 1.5306 1.0685 1.2215 1.1818 1.0439 1.0465 1.0961 1.0793 1.0500 1.0510 1.0761 1.0815 1.0671 1.0419 1.0786 9.2700 1.0590 1.0604 1.0370 1.0631 1.0616 1.0657 1.0968 1.0296 1.0310 1.0963 1.1023 1.0553 1.1044 1.1026 1.0997 1.1046 1.0994 1.1029 1.1049 1.1023 1.1104
irintensity: 0.0217 2.5712 0.2596 0.2347 0.2913 0.4847 2.3790 1.4787 2.5872 0.8590 3.1004 0.9963 1.1878 4.9982 1.3951 0.5015 2.2969 3.2702 5.0690 1.7224 2.2550 6.4680 13.9309 32.0857 1.6737 0.4471 9.4782 24.3495 39.8057 53.7349 4.6195 9.8130 22.2714 94.5304 36.6235 20.3471 31.6205 5.3306 6.4519 16.6444 7.3795 15.2286 1.0293 131.6055 18.6748 13.4170 26.5444 127.7071 39.3817 35.8731 50.3307 121.3015 25.6560 3.6016 244.5371 0.4285 3.5757 1.9445 7.6752 17.3544 1.8401 23.0984 3.8130 93.2341 71.2502 4.4035 0.6653 2.2239 2.9815 23.0922 8.2909 6.2488 17.2393 11.7089 18.4445 9.2207 7.4291 15.2500 5.3524 15.8120 13.1753 3.5377 11.8437 3.8174 12.1367 18.7622 136.3580 23.4766 16.9008 27.4534 63.3816 27.5272 75.1739 13.0326 28.4645 1.0029 3.4446 43.8196 2.2006 37.3183 74.2783 64.7403 24.2917 10.7624 0.6721 17.1414 0.5098 1.2638
temp: 298.150 k
press: 1.00000 atm
elementType: 16 16 15 8 8 8 8 6 6 6 6 6 6 6 6 6 6 1 1 1 1 1 1 1 1 1 1 1 1 1 1 1 1 1 1 1 1 1
symmnumber: 1
zpe: 797206.1 jmol-1
zpe.correction: 0.303640 hartree
zpe.thermalcorrener: 0.327444 hartree
zpe.thermalcorrenthalpy: 0.328388 hartree
zpe.thermalcorrgfe: 0.245253 hartree
zpe.sumelectzpe: -1830.508732 hartree
zpe.sumelectthermal: -1830.484928 hartree
zpe.sumelectthermalent: -1830.483983 hartree
zpe.sumelectthermalfe: -1830.567119 hartree
dipole: 0.8772 0.4098 0.8178
dipole: 1.2674
quadrupole: -112.9569 -125.3527 -122.3174
quadrupole: -9.8418 -1.6603 -2.6071
quadrupole: 7.2521 -5.1436 -2.1084 -9.8418 -1.6603 -2.6071
hfenergy: -1830.8123717 hartree
pointgroup: C01 [X(C10H21O4P1S2)]
dipole: 0.2140613 0.1591637 0.4212731 debye
polarizability: 209.314735|25.7378033|180.4155768|-8.8780671|9.065135|172.2963019 unknown
InChI: InChI=1S/C6H14O2P.C4H7O2S2/c1-3-4-5-6-8-9(2)7;1-6-4(5)2-8-3-7/h3-6H2,1-2H3;2-3H2,1H3
charge 0 multiplicity 1
38 atoms
S  1.26033 -1.195884 -2.660101
S  -0.970788 -3.074861 -1.391669
P  1.57559 -0.473375 -0.474395
O  2.766125 0.772125 -0.624956
O  0.181689 -0.067857 0.209082
O  -4.422398 -2.561891 0.066518
O  -3.648419 -1.063624 -1.541118
C  2.610768 3.220257 -0.309361
C  1.524728 3.288821 0.78578
C  2.432786 2.065015 -1.299272
C  1.7741 4.430249 1.797506
C  0.677573 4.51787 2.880607
C  2.59192 -1.759143 0.389052
C  -0.583635 -1.575551 -2.474979
C  -2.051468 -2.238579 -0.069929
C  -3.41522 -1.874279 -0.612905
C  -5.808465 -2.27035 -0.378128
H  3.614181 3.134397 0.152479
H  2.612688 4.164238 -0.894384
H  0.530641 3.425671 0.312632
H  1.475063 2.321589 1.32257
H  1.398522 2.029375 -1.694195
H  3.140588 2.139209 -2.14333
H  2.761966 4.280264 2.27976
H  1.837036 5.396222 1.254744
H  -0.313954 4.701246 2.425624
H  0.610949 3.573613 3.452932
H  0.878631 5.335962 3.596656
H  2.003247 -2.688582 0.422196
H  2.824552 -1.409386 1.407105
H  3.519138 -1.9216 -0.179539
H  -0.936454 -1.772604 -3.497372
H  -1.106965 -0.706302 -2.053309
H  -2.131864 -2.963754 0.752286
H  -1.497787 -1.338176 0.254754
H  -6.445957 -2.886712 0.27064
H  -5.931661 -2.545953 -1.438827
H  -6.030676 -1.197158 -0.254454
