program: Gaussian 16
title: Title Card Required
version: ES64L-G16RevA.03
frameworkgroup: C2V[C2(CH),SGV(C4H4),X(C4H4)]
method: RO3LYP
basis: def2SVP
operation: Freq
keyword: #N
keyword: Geom=AllCheck
keyword: Guess=TCheck
keyword: SCRF=Check
keyword: GenChk
keyword: RO3LYP/def2SVP
keyword: Freq
converged: YES YES YES YES
title: Mulliken charges:
elementType: C C C C H H C H C H H H C H C H C H
charge: 0.033561 -0.048860 -0.048860 0.033561 0.073203 0.073203 0.134024 0.090505 0.134024 0.090505 0.058857 0.058857 0.033561 0.073203 0.033561 0.073203 0.034340 0.069550
chargesum: 1.00000
title: Mulliken charges with hydrogens summed into heavy atoms:
elementType: C C C C C C C C C
charge: 0.106764 0.009997 0.009997 0.106764 0.224529 0.224529 0.106764 0.106764 0.103890
1716.lowfreq: -271.8459 -7.0089 -1.9448 0.0008 0.0009 0.0010 8.0096 301.1715 346.0266
frequency: -271.8459 301.1715 346.0265 373.2729 398.9354 400.2384 416.2971 510.9838 589.7748 682.9728 719.9885 770.3632 804.9373 818.9574 896.2496 896.9391 907.5599 909.8803 928.8268 931.5620 957.2527 1025.5011 1049.7579 1052.5954 1120.1625 1132.7658 1187.8958 1225.8598 1242.1392 1242.5153 1256.6981 1282.2599 1330.5728 1332.9599 1408.1352 1533.2785 1566.2448 1686.5579 1722.0311 3153.1348 3153.9668 3174.4275 3177.5898 3210.0148 3211.6101 3213.5372 3230.6103 3233.4274
redmass: 2.1959 3.5407 2.2520 2.9114 6.1663 1.7369 3.0517 6.0696 6.6132 1.2365 1.5276 2.1867 4.9448 2.5536 3.7248 2.0064 3.7919 2.4123 1.9887 1.5867 2.7580 2.3438 1.5684 1.5517 1.0190 1.1509 1.2834 1.1631 1.3142 1.3019 1.3406 1.2314 1.3255 1.4928 1.5356 2.8851 4.5734 6.2055 7.0246 1.0893 1.0899 1.0915 1.0933 1.0856 1.0870 1.0964 1.1071 1.1087
irintensity: 0.0000 0.3547 0.2968 0.2556 0.0086 35.1366 0.0000 3.2926 0.0000 6.5365 91.1159 50.0358 3.8685 1.9436 5.6520 3.9503 8.7145 0.0000 1.7037 0.0000 5.4357 0.3795 0.0000 0.2803 0.0137 11.3204 12.9608 36.7425 0.0000 29.2046 15.6077 0.0000 0.3621 42.9168 13.1124 6.1649 104.7834 11.2383 21.6388 1.1090 0.1808 0.1738 4.3134 0.0000 24.1079 6.0490 35.0869 20.7781
temp: 298.150 k
press: 1.00000 atm
elementType: 6 6 6 6 1 1 6 1 6 1 1 1 6 1 6 1 6 1
symmnumber: 2
zpe: 393083.6 jmol-1
zpe.correction: 0.149718 hartree
zpe.thermalcorrener: 0.156046 hartree
zpe.thermalcorrenthalpy: 0.156990 hartree
zpe.thermalcorrgfe: 0.120356 hartree
zpe.sumelectzpe: -347.497821 hartree
zpe.sumelectthermal: -347.491493 hartree
zpe.sumelectthermalent: -347.490549 hartree
zpe.sumelectthermalfe: -347.527183 hartree
dipole: 0.0000 0.0000 1.8584
dipole: 1.8584
quadrupole: -44.8399 -33.9601 -40.3492
quadrupole: -0.0000 -0.0000 0.0000
quadrupole: -5.1235 5.7563 -0.6328 -0.0000 -0.0000 0.0000
hfenergy: -347.6475389 hartree
pointgroup: C02V [C2(C1H1),SGV(C4H4),X(C4H4)]
dipole: 0. 0. 0.7311501 debye
dipolederiv: 0.1188465 -0.0293209 -0.1390866 -0.2907492 -0.1142204 0.3281926 -0.1186007 0.0165147 -0.0805445 -0.2090989 0. 0. 0. 0.2375324 -0.2693033 0. 0.0485379 -0.3432319 -0.209099 0. 0. 0. 0.2375324 0.2693033 0. -0.0485379 -0.3432318 0.1188466 0.0293209 -0.1390866 0.2907492 -0.1142204 -0.3281926 -0.1186007 -0.0165147 -0.0805445 0.1007737 0.0000481 0.030105 0.0455792 0.123859 -0.0606924 0.0194018 -0.0065953 0.1422203 0.1007737 -0.0000481 0.030105 -0.0455792 0.123859 0.0606924 0.0194018 0.0065953 0.1422203 0.0653344 0. 0. 0. 0.5343265 -0.0139983 0. -0.2938023 0.5259727 0.1514048 0. 0. 0. 0.1114867 -0.000183 0. -0.0112695 0.0751265 0.0653344 0. 0. 0. 0.5343265 0.0139983 0. 0.2938023 0.5259727 0.1514048 0. 0. 0. 0.1114867 0.000183 0. 0.0112695 0.0751265 0.0573765 0. 0. 0. 0.0175608 -0.007168 0. -0.0057201 0.0638466 0.0573765 0. 0. 0. 0.0175608 0.007168 0. 0.0057201 0.0638466 0.1188465 -0.0293209 0.1390866 -0.2907492 -0.1142204 -0.3281926 0.1186007 -0.0165147 -0.0805445 0.1007737 0.0000481 -0.030105 0.0455792 0.123859 0.0606924 -0.0194018 0.0065953 0.1422203 0.1188465 0.0293209 0.1390866 0.2907492 -0.1142204 0.3281926 0.1186008 0.0165147 -0.0805444 0.1007737 -0.0000481 -0.030105 -0.0455792 0.123859 -0.0606924 -0.0194018 -0.0065953 0.1422203 -0.1568567 0. 0. 0. -0.9255497 0. 0. 0. 0.0323181 0.148342 0. 0. 0. 0.0851826 0. 0. 0. 0.0775505 unknown
polarizability: 66.6969848|0.0000001|97.5936784|0.|0.|80.0030199 unknown
InChI: InChI=1/9C.9H
charge 1 multiplicity 1
18 atoms
C  1.24053399 0.66190612 -0.89133385
C  0.0000 1.38069056 -0.31013304
C  0.0000 -1.38069056 -0.31013304
C  1.24053399 -0.66190612 -0.89133385
H  2.04442475 1.28682901 -1.28701473
H  2.04442475 -1.28682901 -1.28701473
C  0.0000 1.22159517 1.16040052
H  0.0000 2.13100391 1.7750123
C  0.0000 -1.22159517 1.16040052
H  0.0000 -2.13100391 1.7750123
H  0.0000 -2.44332021 -0.57657377
H  0.0000 2.44332021 -0.57657377
C  -1.24053399 -0.66190612 -0.89133385
H  -2.04442475 -1.28682901 -1.28701473
C  -1.24053399 0.66190612 -0.89133385
H  -2.04442475 1.28682901 -1.28701473
C  0.0000 0.0000 1.83093553
H  0.0000 0.0000 2.92358679
