program: Gaussian 16
title: Title Card Required
version: ES64L-G16RevA.03
frameworkgroup: C2V[C2(CH),SGV(C4H4),X(C4H4)]
method: RTPSSTPSS
basis: def2SVP
operation: Freq
keyword: #N
keyword: Geom=AllCheck
keyword: Guess=TCheck
keyword: SCRF=Check
keyword: GenChk
keyword: RTPSSTPSS/def2SVP
keyword: Freq
converged: YES YES YES YES
title: Mulliken charges:
elementType: C C C C H H C H C H H H C H C H C H
charge: 0.003718 -0.015472 -0.015472 0.003718 0.090901 0.090901 0.096329 0.104342 0.096329 0.104342 0.070345 0.070345 0.003718 0.090901 0.003718 0.090901 0.025444 0.084993
chargesum: 1.00000
title: Mulliken charges with hydrogens summed into heavy atoms:
elementType: C C C C C C C C C
charge: 0.094619 0.054873 0.054873 0.094619 0.200671 0.200671 0.094619 0.094619 0.110437
1716.lowfreq: -288.3784 -12.7617 -4.1983 -1.5297 0.0003 0.0007 0.0009 294.1972 317.6551
frequency: -288.3783 294.1972 317.6549 364.9261 378.1812 400.6416 405.1971 497.6785 576.3623 677.3961 713.7805 754.5528 789.5334 802.4787 878.3861 881.2972 884.8067 891.2365 912.4511 913.0873 941.3709 1004.1295 1037.7925 1041.3262 1110.4050 1126.4222 1178.2491 1219.1041 1230.7243 1230.9014 1244.3602 1276.6524 1321.8553 1324.7447 1407.4739 1519.8820 1545.3127 1659.4208 1693.7494 3114.8491 3115.7026 3139.8952 3143.0398 3172.6502 3174.2699 3175.5454 3193.0207 3195.8789
redmass: 2.1895 3.5692 2.0823 2.9862 7.4154 1.7545 3.1151 6.1103 6.6742 1.2358 1.5369 2.4328 4.7399 2.6561 1.9294 3.0489 3.6648 2.9432 2.4103 1.4551 2.8809 2.5025 1.5530 1.5236 1.0175 1.1613 1.3197 1.2273 1.2163 1.2717 1.3163 1.2251 1.4781 1.3372 1.4932 2.6361 4.1468 5.9529 6.8584 1.0885 1.0892 1.0907 1.0925 1.0848 1.0863 1.0956 1.1066 1.1082
irintensity: 0.0000 0.3420 0.0963 0.2141 0.1039 34.8723 0.0000 2.8269 0.0000 5.6869 90.4400 52.3015 4.1256 1.3636 6.3504 0.0000 5.6079 7.5478 3.6942 0.0000 6.1519 0.6108 0.0000 0.4533 0.0038 13.4599 11.1491 46.2274 18.1880 0.0000 13.7512 0.0000 39.5502 0.0007 11.5126 4.3967 87.3417 13.2336 23.9921 2.5699 0.5471 0.0446 1.7509 0.0000 18.2732 2.8782 29.9084 18.8150
temp: 298.150 k
press: 1.00000 atm
elementType: 6 6 6 6 1 1 6 1 6 1 1 1 6 1 6 1 6 1
symmnumber: 2
zpe: 388024.2 jmol-1
zpe.correction: 0.147791 hartree
zpe.thermalcorrener: 0.154274 hartree
zpe.thermalcorrenthalpy: 0.155218 hartree
zpe.thermalcorrgfe: 0.118316 hartree
zpe.sumelectzpe: -347.694778 hartree
zpe.sumelectthermal: -347.688294 hartree
zpe.sumelectthermalent: -347.687350 hartree
zpe.sumelectthermalfe: -347.724252 hartree
dipole: -0.0000 -0.0000 1.7452
dipole: 1.7452
quadrupole: -44.7408 -33.9736 -40.3701
quadrupole: 0.0000 0.0000 -0.0000
quadrupole: -5.0460 5.7212 -0.6752 0.0000 0.0000 -0.0000
hfenergy: -347.8425682 hartree
pointgroup: C02V [C2(C1H1),SGV(C4H4),X(C4H4)]
dipole: 0. 0. 0.6866027 debye
dipolederiv: 0.1315805 -0.0220423 -0.1448115 -0.303264 -0.1106841 0.3385894 -0.1257231 0.0119098 -0.0752609 -0.2017459 0. 0. 0. 0.2640126 -0.2783643 0. 0.044411 -0.325788 -0.2017459 0. 0. 0. 0.2640126 0.2783643 0. -0.044411 -0.325788 0.1315805 0.0220423 -0.1448115 0.303264 -0.1106841 -0.3385894 -0.1257231 -0.0119098 -0.0752609 0.0928859 -0.0073047 0.0355253 0.0448595 0.1186327 -0.0616684 0.0234512 -0.0049076 0.1396642 0.0928859 0.0073047 0.0355253 -0.0448595 0.1186327 0.0616684 0.0234512 0.0049076 0.1396642 0.0452724 0. 0. 0. 0.5099023 -0.0045529 0. -0.2566821 0.5122865 0.1556016 0. 0. 0. 0.0962653 -0.0047053 0. -0.019187 0.0659809 0.0452724 0. 0. 0. 0.5099023 0.0045529 0. 0.2566821 0.5122865 0.1556016 0. 0. 0. 0.0962653 0.0047053 0. 0.019187 0.0659809 0.0532593 0. 0. 0. 0.0005567 -0.0118803 0. -0.0083356 0.0596243 0.0532593 0. 0. 0. 0.0005567 0.0118803 0. 0.0083356 0.0596243 0.1315804 -0.0220423 0.1448115 -0.303264 -0.1106841 -0.3385894 0.1257231 -0.0119098 -0.0752609 0.0928859 -0.0073047 -0.0355253 0.0448595 0.1186327 0.0616684 -0.0234512 0.0049076 0.1396642 0.1315805 0.0220423 0.1448115 0.303264 -0.1106841 0.3385894 0.1257231 0.0119098 -0.0752609 0.0928859 0.0073047 -0.0355253 -0.0448595 0.1186327 -0.0616684 -0.0234512 -0.0049076 0.1396642 -0.1491834 0. 0. 0. -0.8547737 0. 0. 0. 0.0611489 0.1465432 0. 0. 0. 0.0815058 0. 0. 0. 0.0570305 unknown
polarizability: 68.2337834|0.|98.9929302|0.|0.|82.0876066 unknown
InChI: InChI=1/9C.9H
charge 1 multiplicity 1
18 atoms
C  1.24567601 0.66376262 -0.89476506
C  0.0000 1.38955289 -0.31009154
C  0.0000 -1.38955289 -0.31009154
C  1.24567601 -0.66376262 -0.89476506
H  2.04903731 1.29375186 -1.28952728
H  2.04903731 -1.29375186 -1.28952728
C  0.0000 1.22778289 1.16456514
H  0.0000 2.13787599 1.78107349
C  0.0000 -1.22778289 1.16456514
H  0.0000 -2.13787599 1.78107349
H  0.0000 -2.45378646 -0.57950612
H  0.0000 2.45378646 -0.57950612
C  -1.24567601 -0.66376262 -0.89476506
H  -2.04903731 -1.29375186 -1.28952728
C  -1.24567601 0.66376262 -0.89476506
H  -2.04903731 1.29375186 -1.28952728
C  0.0000 0.0000 1.83436952
H  0.0000 0.0000 2.92925787
