program: Gaussian 16
title: Title Card Required
version: ES64L-G16RevA.03
frameworkgroup: C2V[C2(CH),SGV(C4H4),X(C4H4)]
method: RmPW1PW91
basis: def2SVP
operation: Freq
keyword: #N
keyword: Geom=AllCheck
keyword: Guess=TCheck
keyword: SCRF=Check
keyword: GenChk
keyword: RmPW1PW91/def2SVP
keyword: Freq
converged: YES YES YES YES
title: Mulliken charges:
elementType: C C C C H H C H C H H H C H C H C H
charge: -0.001956 -0.081161 -0.081161 -0.001956 0.105224 0.105224 0.107935 0.123162 0.107935 0.123162 0.092413 0.092413 -0.001956 0.105224 -0.001956 0.105224 -0.000570 0.102798
chargesum: 1.00000
title: Mulliken charges with hydrogens summed into heavy atoms:
elementType: C C C C C C C C C
charge: 0.103268 0.011253 0.011253 0.103268 0.231097 0.231097 0.103268 0.103268 0.102228
1716.lowfreq: -261.6257 -13.2055 -10.4289 -7.8887 -0.0011 -0.0010 -0.0002 303.2691 366.2963
frequency: -261.6255 303.2691 366.2960 375.9130 395.2583 423.4866 424.0526 515.4048 597.9529 694.4847 731.8405 784.3860 819.0097 831.2794 906.8192 914.1457 923.1384 933.7254 953.9240 953.9549 970.2768 1040.8594 1068.3115 1068.5908 1131.4518 1146.7738 1198.4546 1236.3291 1262.5609 1263.5147 1273.3684 1297.7874 1345.4550 1348.9753 1426.0681 1556.5950 1587.8512 1714.3328 1750.1282 3174.7672 3175.5539 3201.1351 3203.9904 3236.4549 3237.9491 3239.7863 3256.7710 3259.3058
redmass: 2.2183 3.5579 3.1834 2.9008 1.7362 3.0740 3.6804 5.9908 6.4946 1.2376 1.5435 2.0968 4.9066 2.5098 3.6612 2.0193 4.7106 2.5689 1.4575 1.7349 2.6964 2.2363 1.5550 1.5601 1.0175 1.1542 1.2687 1.1171 1.4051 1.3572 1.3639 1.2401 1.3277 1.5101 1.5473 2.9605 4.6080 6.2719 7.0515 1.0894 1.0900 1.0917 1.0934 1.0859 1.0873 1.0966 1.1075 1.1090
irintensity: 0.0000 0.2262 0.4321 0.2500 38.1713 0.0000 0.1800 3.4827 0.0000 7.0937 99.0346 52.8744 5.1354 1.9893 7.9601 3.9359 10.0455 0.0000 0.0000 0.6985 4.3336 0.1288 0.2171 0.0000 0.0086 11.3204 13.4806 30.2498 43.3733 0.0000 18.3258 0.0000 0.4822 46.2829 14.7562 7.2637 126.7142 10.2069 20.1959 0.6431 0.1294 0.2004 5.1985 0.0000 22.8339 6.9816 32.4324 18.4003
temp: 298.150 k
press: 1.00000 atm
elementType: 6 6 6 6 1 1 6 1 6 1 1 1 6 1 6 1 6 1
symmnumber: 2
zpe: 397888.4 jmol-1
zpe.correction: 0.151548 hartree
zpe.thermalcorrener: 0.157755 hartree
zpe.thermalcorrenthalpy: 0.158699 hartree
zpe.thermalcorrgfe: 0.122261 hartree
zpe.sumelectzpe: -347.535058 hartree
zpe.sumelectthermal: -347.528851 hartree
zpe.sumelectthermalent: -347.527907 hartree
zpe.sumelectthermalfe: -347.564345 hartree
dipole: -0.0000 -0.0000 1.9669
dipole: 1.9669
quadrupole: -44.9810 -33.5810 -40.3477
quadrupole: 0.0000 -0.0000 0.0000
quadrupole: -5.3445 6.0556 -0.7111 0.0000 -0.0000 0.0000
hfenergy: -347.6866057 hartree
pointgroup: C02V [C2(C1H1),SGV(C4H4),X(C4H4)]
dipole: 0. 0. 0.7738271 debye
dipolederiv: 0.1188004 -0.0260148 -0.150816 -0.2812597 -0.1147913 0.3190444 -0.1248623 0.0172406 -0.0922233 -0.2242729 0. 0. 0. 0.2347549 -0.2708369 0. 0.0419273 -0.3516381 -0.2242729 0. 0. 0. 0.2347549 0.2708369 0. -0.0419272 -0.3516381 0.1188004 0.0260148 -0.1508159 0.2812597 -0.1147913 -0.3190444 -0.1248624 -0.0172406 -0.0922233 0.1015783 -0.0006481 0.0339152 0.0415402 0.1232854 -0.0561408 0.0229896 -0.0034294 0.147835 0.1015783 0.0006482 0.0339152 -0.0415402 0.1232854 0.0561408 0.0229896 0.0034294 0.147835 0.078512 0. 0. 0. 0.5811864 -0.0185982 0. -0.3232609 0.5456576 0.1529637 0. 0. 0. 0.1187024 0.0002799 0. -0.011671 0.0801992 0.078512 0. 0. 0. 0.5811864 0.0185982 0. 0.3232609 0.5456576 0.1529637 0. 0. 0. 0.1187024 -0.0002799 0. 0.011671 0.0801991 0.0629556 0. 0. 0. 0.0194529 -0.0073758 0. -0.006315 0.0676919 0.0629556 0. 0. 0. 0.0194528 0.0073758 0. 0.006315 0.0676919 0.1188004 -0.0260148 0.1508159 -0.2812597 -0.1147913 -0.3190444 0.1248624 -0.0172406 -0.0922233 0.1015783 -0.0006481 -0.0339152 0.0415402 0.1232854 0.0561408 -0.0229896 0.0034294 0.147835 0.1188004 0.0260148 0.1508159 0.2812597 -0.1147913 0.3190444 0.1248623 0.0172406 -0.0922233 0.1015783 0.0006481 -0.0339152 -0.0415402 0.1232854 -0.0561408 -0.0229896 -0.0034294 0.147835 -0.1788272 0. 0. 0. -1.0304097 0. 0. 0. 0.0119464 0.1569959 0. 0. 0. 0.0882399 0. 0. 0. 0.0817857 unknown
polarizability: 65.4570121|0.|96.9113948|0.|0.|77.9257649 unknown
InChI: InChI=1/9C.9H
charge 1 multiplicity 1
18 atoms
C  1.23823005 0.65997789 -0.88759633
C  0.0000 1.37621675 -0.3111435
C  0.0000 -1.37621675 -0.3111435
C  1.23823005 -0.65997789 -0.88759633
H  2.04314277 1.28076656 -1.28288695
H  2.04314277 -1.28076656 -1.28288695
C  0.0000 1.21692729 1.15634554
H  0.0000 2.12461216 1.77028846
C  0.0000 -1.21692729 1.15634554
H  0.0000 -2.12461216 1.77028846
H  0.0000 -2.4377749 -0.57660821
H  0.0000 2.4377749 -0.57660821
C  -1.23823005 -0.65997789 -0.88759633
H  -2.04314277 -1.28076656 -1.28288695
C  -1.23823005 0.65997789 -0.88759633
H  -2.04314277 1.28076656 -1.28288695
C  0.0000 0.0000 1.82592603
H  0.0000 0.0000 2.91678249
