program: Gaussian 16
title: Title Card Required
version: ES64L-G16RevA.03
frameworkgroup: CS[SG(C3H3),X(C6H6)]
method: RmPW1PW91
basis: def2SVP
operation: Freq
keyword: #N
keyword: Geom=AllCheck
keyword: Guess=TCheck
keyword: SCRF=Check
keyword: GenChk
keyword: RmPW1PW91/def2SVP
keyword: Freq
converged: YES YES NO YES
title: Mulliken charges:
elementType: C C C H H H C H C H C H C H C H C H
charge: -0.072865 -0.072865 -0.181523 0.122024 0.122024 0.126507 0.272124 0.112164 -0.098107 0.112535 -0.119750 0.117330 0.182837 0.098574 -0.119750 0.117330 0.182837 0.098574
chargesum: 1.00000
title: Mulliken charges with hydrogens summed into heavy atoms:
elementType: C C C C C C C C C
charge: 0.049159 0.049159 -0.055015 0.384288 0.014427 -0.002420 0.281411 -0.002420 0.281411
1716.lowfreq: -273.1813 -0.0004 0.0005 0.0005 5.7099 6.4635 10.7346 290.0984 410.8764
frequency: -273.1813 290.0983 410.8763 467.1249 477.9554 501.7370 524.9473 604.7875 629.0268 675.5138 738.9552 752.9531 800.6853 853.8344 892.3556 909.9120 927.5667 930.7928 956.0841 974.6192 1006.6766 1011.1545 1067.1153 1078.6389 1096.0727 1140.0799 1145.2874 1153.1252 1169.7522 1180.0527 1282.0138 1303.1802 1318.4683 1420.0778 1432.1553 1444.1943 1533.6884 1618.1711 1637.6595 3206.5846 3222.6409 3227.0559 3238.6654 3239.9718 3240.7706 3254.4007 3256.4611 3258.1515
redmass: 6.2032 3.9668 4.6819 2.2832 2.4258 5.0643 6.2146 5.2385 2.3278 4.5141 2.5360 1.5575 1.5682 2.1341 2.2717 1.7706 2.1241 3.1125 1.5402 1.5386 1.3166 1.8284 1.6720 1.4740 1.2829 1.2331 1.1273 1.1398 1.1157 1.2775 2.0596 1.2421 1.2762 2.7728 2.0112 2.0590 3.3936 5.5559 6.2881 1.0928 1.0923 1.0928 1.0909 1.0921 1.0915 1.1000 1.1016 1.1009
irintensity: 26.3521 1.3659 2.3441 1.5871 1.4239 0.1262 4.6514 4.3767 2.9056 1.8090 20.6204 41.9136 18.1630 5.0393 8.9424 6.5759 33.9276 3.8452 4.3674 5.0504 0.0691 17.8126 7.0515 0.0022 0.0445 9.5342 1.9369 2.5109 3.5093 1.5031 39.6955 1.1969 3.4093 5.2766 34.4556 6.1263 14.6343 6.1738 0.0258 1.6880 0.0998 6.0233 26.8544 40.4488 3.4984 30.5226 14.8834 10.7673
temp: 298.150 k
press: 1.00000 atm
elementType: 6 6 6 1 1 1 6 1 6 1 6 1 6 1 6 1 6 1
symmnumber: 1
zpe: 397770.8 jmol-1
zpe.correction: 0.151503 hartree
zpe.thermalcorrener: 0.157348 hartree
zpe.thermalcorrenthalpy: 0.158292 hartree
zpe.thermalcorrgfe: 0.121920 hartree
zpe.sumelectzpe: -347.547148 hartree
zpe.sumelectthermal: -347.541303 hartree
zpe.sumelectthermalent: -347.540359 hartree
zpe.sumelectthermalfe: -347.576731 hartree
dipole: -0.6137 0.0491 -0.0000
dipole: 0.6157
quadrupole: -41.0950 -35.1648 -43.5082
quadrupole: 2.1546 -0.0000 -0.0000
quadrupole: -1.1723 4.7578 -3.5855 2.1546 -0.0000 -0.0000
hfenergy: -347.698651 hartree
pointgroup: CS [SG(C3H3),X(C6H6)]
dipole: -0.2418401 0.0138304 0. debye
dipolederiv: 0.2535801 -0.1851734 0.0057724 -0.1169319 0.0775581 -0.0563519 -0.0721579 0.0316973 0.0675657 0.2535801 -0.1851734 -0.0057724 -0.1169319 0.0775581 0.0563519 0.0721579 -0.0316973 0.0675657 -0.0913283 0.2580941 0. 0.3175972 -0.3374479 0. 0. 0. -0.0266392 0.1214268 0.0216886 -0.0357222 -0.0253861 0.1048795 -0.0020326 -0.0307227 0.0166585 0.0983728 0.1214268 0.0216886 0.0357222 -0.0253861 0.1048795 0.0020326 0.0307227 -0.0166585 0.0983728 0.0827567 0.0079776 0. 0.0307007 0.1066644 0. 0. 0. 0.1432309 -0.0524141 0.0837301 0. 0.1551039 0.2969049 0. 0. 0. -0.0629464 0.1615105 -0.0131708 0. -0.0144326 0.1236044 0. 0. 0. 0.1098864 -0.5265421 -0.1629522 0. -0.1086847 0.0883776 0. 0. 0. 0.0782702 0.0786138 0.0216785 0. -0.0007819 0.0756299 0. 0. 0. 0.1259885 0.2266392 0.0142123 0.1456743 0.027546 -0.058731 0.0509336 -0.1712754 -0.0543094 0.1622372 0.145137 -0.0033745 -0.0068278 0.0058305 0.123063 0.0361517 -0.0584711 0.0035474 0.0756435 -0.130221 0.082663 -0.0038456 -0.0840843 -0.0464826 0.0318965 -0.0986756 0.0410938 -0.2593415 0.0571396 -0.0276946 -0.0191211 0.0032745 0.1228462 0.0046533 0.0669133 0.0096879 0.1716271 0.2266392 0.0142123 -0.1456743 0.027546 -0.058731 -0.0509336 0.1712754 0.0543094 0.1622372 0.145137 -0.0033745 0.0068278 0.0058305 0.123063 -0.0361517 0.0584712 -0.0035474 0.0756435 -0.130221 0.082663 0.0038456 -0.0840843 -0.0464826 -0.0318965 0.0986755 -0.0410938 -0.2593415 0.0571396 -0.0276946 0.0191211 0.0032745 0.1228462 -0.0046533 -0.0669132 -0.0096879 0.1716271 unknown
polarizability: 78.386848|2.7986681|88.696143|0.|0.|77.6263267 unknown
InChI: InChI=1/9C.9H
charge 1 multiplicity 1
18 atoms
C  0.05353769 -1.29655741 0.75108903
C  0.05353769 -1.29655741 -0.75108903
C  -1.29889821 -0.80967121 0.0000
H  -0.07178847 -2.27568746 1.21748296
H  -0.07178847 -2.27568746 -1.21748296
H  -2.12526595 -1.52053647 0.0000
C  -1.50782561 0.55082338 0.0000
H  -2.51690612 0.96671334 0.0000
C  -0.35856454 1.42195933 0.0000
H  -0.56170441 2.49539298 0.0000
C  0.74056263 1.00496359 0.98664805
H  1.37766925 1.80215463 1.37109736
C  0.76957516 -0.27340879 1.44917615
H  1.36525116 -0.54023523 2.32313815
C  0.74056263 1.00496359 -0.98664805
H  1.37766925 1.80215463 -1.37109736
C  0.76957516 -0.27340879 -1.44917615
H  1.36525116 -0.54023523 -2.32313815
