program: Gaussian 16
title: Title Card Required
version: ES64L-G16RevA.03
frameworkgroup: C2V[C2(CH),SGV(C4H4),X(C4H4)]
method: RB3LYP
basis: def2SVP
operation: Freq
keyword: #N
keyword: Geom=AllCheck
keyword: Guess=TCheck
keyword: SCRF=Check
keyword: GenChk
keyword: RB3LYP/def2SVP
keyword: Freq
converged: YES YES YES YES
title: Mulliken charges:
elementType: C C C C H H C H C H H H C H C H C H
charge: 0.003972 0.043673 0.043673 0.003972 0.074410 0.074410 0.094624 0.096565 0.094624 0.096565 0.052885 0.052885 0.003972 0.074410 0.003972 0.074410 0.039037 0.071941
chargesum: 1.00000
title: Mulliken charges with hydrogens summed into heavy atoms:
elementType: C C C C C C C C C
charge: 0.078382 0.096558 0.096558 0.078382 0.191189 0.191189 0.078382 0.078382 0.110978
1716.lowfreq: -243.9127 -2.7461 -0.0014 -0.0011 -0.0010 1.8581 6.2252 303.4383 366.8156
frequency: -243.9127 303.4383 366.8156 374.9704 403.0635 421.6495 422.6424 517.7031 595.4116 688.9504 724.9403 767.0677 802.7912 812.4504 895.2108 904.3282 906.5989 921.5016 942.9791 944.9466 952.5739 1019.7351 1059.1168 1063.4316 1126.0388 1140.1041 1186.8797 1230.4702 1252.9727 1254.0010 1263.4596 1295.1954 1339.8074 1340.8643 1417.9824 1537.2630 1563.2291 1688.6818 1722.3549 3142.4796 3143.2860 3168.7550 3171.5529 3202.6213 3204.1490 3205.1334 3222.1971 3224.7431
redmass: 2.2133 3.5350 3.0718 2.8760 1.7336 3.0550 3.7366 6.0472 6.5809 1.2371 1.5676 2.4012 4.8191 2.6219 1.8976 3.6870 3.1901 3.9239 1.3651 1.9288 2.8221 2.3706 1.5640 1.5492 1.0177 1.1644 1.3005 1.1616 1.3176 1.3157 1.3327 1.2294 1.4691 1.3277 1.5041 2.7395 4.2447 6.0430 6.9091 1.0893 1.0899 1.0914 1.0929 1.0857 1.0872 1.0960 1.1066 1.1082
irintensity: 0.0000 0.3155 0.4216 0.2714 36.9006 0.0000 0.1280 3.4612 0.0000 6.2708 93.4471 47.7460 3.9352 0.9511 6.0245 6.3068 0.0000 9.8204 0.0000 1.7387 6.4367 0.2122 0.0000 0.1662 0.0061 12.7828 13.0641 39.0595 32.3612 0.0000 14.9766 0.0000 40.3037 0.2016 11.8388 5.3597 116.0259 9.8326 20.5306 1.7862 0.3597 0.1193 3.7369 0.0000 19.3531 5.0241 27.0335 16.3594
temp: 298.150 k
press: 1.00000 atm
elementType: 6 6 6 6 1 1 6 1 6 1 1 1 6 1 6 1 6 1
symmnumber: 2
zpe: 393909.6 jmol-1
zpe.correction: 0.150032 hartree
zpe.thermalcorrener: 0.156281 hartree
zpe.thermalcorrenthalpy: 0.157225 hartree
zpe.thermalcorrgfe: 0.120723 hartree
zpe.sumelectzpe: -347.614002 hartree
zpe.sumelectthermal: -347.607754 hartree
zpe.sumelectthermalent: -347.606810 hartree
zpe.sumelectthermalfe: -347.643312 hartree
dipole: 0.0000 0.0000 1.9567
dipole: 1.9567
quadrupole: -45.2475 -34.2430 -40.5832
quadrupole: 0.0000 0.0000 0.0000
quadrupole: -5.2229 5.7816 -0.5587 0.0000 0.0000 0.0000
hfenergy: -347.7640346 hartree
pointgroup: C02V [C2(C1H1),SGV(C4H4),X(C4H4)]
dipole: 0. 0. 0.7698429 debye
dipolederiv: 0.1255243 -0.0206675 -0.1515399 -0.2733881 -0.1081518 0.3188669 -0.1227457 0.0140415 -0.078971 -0.2137678 0. 0. 0. 0.2493807 -0.2756343 0. 0.0423603 -0.3424267 -0.2137678 0. 0. 0. 0.2493807 0.2756343 0. -0.0423603 -0.3424267 0.1255243 0.0206675 -0.1515399 0.2733881 -0.1081518 -0.3188669 -0.1227457 -0.0140416 -0.078971 0.0929956 -0.0024182 0.0355984 0.0402031 0.116843 -0.0560467 0.0239876 -0.0030079 0.1401589 0.0929956 0.0024182 0.0355984 -0.0402031 0.116843 0.0560467 0.0239876 0.0030079 0.1401589 0.0791883 0. 0. 0. 0.5700398 -0.0117819 0. -0.3090113 0.5341431 0.1500807 0. 0. 0. 0.1109536 -0.0012621 0. -0.0126818 0.0736833 0.0791883 0. 0. 0. 0.5700398 0.0117819 0. 0.3090113 0.5341431 0.1500807 0. 0. 0. 0.1109536 0.0012621 0. 0.0126818 0.0736833 0.0556149 0. 0. 0. 0.006241 -0.0101975 0. -0.0066253 0.060133 0.0556149 0. 0. 0. 0.006241 0.0101975 0. 0.0066253 0.060133 0.1255243 -0.0206675 0.1515399 -0.2733881 -0.1081518 -0.3188669 0.1227457 -0.0140416 -0.078971 0.0929956 -0.0024182 -0.0355984 0.0402031 0.116843 0.0560467 -0.0239876 0.0030079 0.1401589 0.1255243 0.0206675 0.1515399 0.2733881 -0.1081518 0.3188669 0.1227457 0.0140416 -0.078971 0.0929956 0.0024182 -0.0355984 -0.0402031 0.116843 -0.0560467 -0.0239876 -0.0030079 0.1401589 -0.1664885 0. 0. 0. -0.9917545 0. 0. 0. 0.0328216 0.1501767 0. 0. 0. 0.0837594 0. 0. 0. 0.0713612 unknown
polarizability: 66.1889042|0.|98.1147096|0.|0.|79.1492699 unknown
InChI: InChI=1/9C.9H
charge 1 multiplicity 1
18 atoms
C  1.24525699 0.6614766 -0.8934479
C  0.0000 1.38154294 -0.31010564
C  0.0000 -1.38154294 -0.31010564
C  1.24525699 -0.6614766 -0.8934479
H  2.04888851 1.28557397 -1.29053215
H  2.04888851 -1.28557397 -1.29053215
C  0.0000 1.2215038 1.16370944
H  0.0000 2.13035799 1.77858798
C  0.0000 -1.2215038 1.16370944
H  0.0000 -2.13035799 1.77858798
H  0.0000 -2.44473296 -0.57544008
H  0.0000 2.44473296 -0.57544008
C  -1.24525699 -0.6614766 -0.8934479
H  -2.04888851 -1.28557397 -1.29053215
C  -1.24525699 0.6614766 -0.8934479
H  -2.04888851 1.28557397 -1.29053215
C  0.0000 0.0000 1.83417038
H  0.0000 0.0000 2.92678642
