program: Gaussian 16
title: Title Card Required
version: ES64L-G16RevA.03
frameworkgroup: CS[SG(C3H3),X(C6H6)]
method: RPBE1PBE
basis: def2SVP
operation: Freq
keyword: #N
keyword: Geom=AllCheck
keyword: Guess=TCheck
keyword: SCRF=Check
keyword: GenChk
keyword: RPBE1PBE/def2SVP
keyword: Freq
converged: YES YES YES YES
title: Mulliken charges:
elementType: C C C H H H C H C H C H C H C H C H
charge: -0.076077 -0.076077 -0.185919 0.125152 0.125152 0.129659 0.276625 0.116114 -0.117343 0.115013 -0.115437 0.118948 0.179230 0.101109 -0.115437 0.118948 0.179230 0.101109
chargesum: 1.00000
title: Mulliken charges with hydrogens summed into heavy atoms:
elementType: C C C C C C C C C
charge: 0.049074 0.049074 -0.056260 0.392739 -0.002330 0.003511 0.280340 0.003511 0.280340
1716.lowfreq: -257.9830 0.0005 0.0007 0.0008 4.8205 8.3491 11.4485 293.1196 410.5698
frequency: -257.9829 293.1195 410.5697 463.1303 475.2170 505.3339 524.1279 605.6870 627.8601 676.8498 742.5317 751.5584 796.4572 858.1524 890.6112 908.7014 924.8713 930.7247 952.9321 971.3072 1005.7339 1009.6839 1065.0844 1075.8874 1093.6816 1139.8152 1142.2500 1152.7799 1165.7640 1178.8633 1285.8720 1297.7632 1314.4783 1418.1764 1428.8144 1440.3467 1537.1099 1622.9393 1643.6459 3200.0504 3216.5355 3221.0635 3232.8060 3233.9157 3234.9047 3249.2518 3251.2503 3252.8862
redmass: 5.9961 3.8251 4.6607 2.3110 2.4438 5.0087 6.0721 5.1563 2.3444 4.1161 2.3651 1.5957 1.5873 2.2008 2.2033 1.7397 2.1018 3.4167 1.5147 1.5444 1.3249 1.8564 1.6539 1.4609 1.2810 1.1794 1.1248 1.1986 1.1065 1.2670 2.0066 1.2439 1.2963 2.8344 2.0563 2.0785 3.5556 5.6792 6.4323 1.0928 1.0923 1.0929 1.0909 1.0922 1.0916 1.1000 1.1018 1.1011
irintensity: 27.3571 1.7432 3.3748 1.5490 1.7680 0.0000 4.6941 3.6723 3.2423 1.7098 25.4129 45.5404 15.4373 4.8443 8.3261 6.5994 35.4797 4.4869 4.8613 4.8614 0.2007 17.1994 6.4421 0.0005 0.0421 6.7985 2.3983 5.6632 3.5904 1.1081 38.8749 1.3189 5.7982 5.0448 36.4104 5.6001 14.3914 7.1151 0.0113 1.8191 0.1876 6.6059 28.5274 42.0429 5.5920 32.7478 15.7275 11.3195
temp: 298.150 k
press: 1.00000 atm
elementType: 6 6 6 1 1 1 6 1 6 1 6 1 6 1 6 1 6 1
symmnumber: 1
zpe: 397286.4 jmol-1
zpe.correction: 0.151318 hartree
zpe.thermalcorrener: 0.157167 hartree
zpe.thermalcorrenthalpy: 0.158111 hartree
zpe.thermalcorrgfe: 0.121735 hartree
zpe.sumelectzpe: -347.210963 hartree
zpe.sumelectthermal: -347.205115 hartree
zpe.sumelectthermalent: -347.204171 hartree
zpe.sumelectthermalfe: -347.240547 hartree
dipole: -0.6665 0.0344 -0.0000
dipole: 0.6674
quadrupole: -41.1397 -35.2038 -43.6596
quadrupole: 2.1527 -0.0000 0.0000
quadrupole: -1.1387 4.7972 -3.6586 2.1527 -0.0000 0.0000
hfenergy: -347.3622813 hartree
pointgroup: CS [SG(C3H3),X(C6H6)]
dipole: -0.2624925 0.0066201 0. debye
dipolederiv: 0.2642405 -0.1856936 0.0245851 -0.1131732 0.0789973 -0.0517774 -0.0669434 0.0395558 0.0735035 0.2642405 -0.1856936 -0.0245851 -0.1131731 0.0789973 0.0517774 0.0669434 -0.0395558 0.0735034 -0.1075974 0.2660741 0. 0.3292688 -0.3472755 0. 0. 0. -0.0477002 0.1214309 0.0232333 -0.0352573 -0.0257256 0.1084657 -0.0038904 -0.0307821 0.0148267 0.1005635 0.1214309 0.0232333 0.0352573 -0.0257256 0.1084657 0.0038904 0.0307821 -0.0148267 0.1005635 0.0866019 0.0102162 0. 0.0322143 0.1091244 0. 0. 0. 0.1442599 -0.0453708 0.0839073 0. 0.1486541 0.3097444 0. 0. 0. -0.0643073 0.1664797 -0.014591 0. -0.0162935 0.1256944 0. 0. 0. 0.1146631 -0.5373564 -0.1765233 0. -0.10501 0.0896928 0. 0. 0. 0.0612927 0.0796231 0.0205516 0. -0.0010862 0.077997 0. 0. 0. 0.1248973 0.2235501 0.0209655 0.1565026 0.0238121 -0.0581047 0.0394432 -0.1622543 -0.0724387 0.167635 0.1474716 -0.0024831 -0.0054695 0.0076937 0.1261737 0.0372888 -0.0590025 0.0045778 0.0769319 -0.1372988 0.0791026 -0.0026798 -0.0881202 -0.0620562 0.0316872 -0.0991352 0.04447 -0.2628289 0.0594158 -0.0299422 -0.0203818 0.0016393 0.1240353 0.0038811 0.0688802 0.0101248 0.1776422 0.2235501 0.0209655 -0.1565026 0.0238121 -0.0581047 -0.0394432 0.1622543 0.0724387 0.167635 0.1474716 -0.0024831 0.0054695 0.0076937 0.1261737 -0.0372888 0.0590025 -0.0045778 0.0769319 -0.1372988 0.0791026 0.0026798 -0.0881202 -0.0620562 -0.0316872 0.0991352 -0.04447 -0.2628289 0.0594158 -0.0299422 0.0203818 0.0016393 0.1240353 -0.0038811 -0.0688802 -0.0101248 0.1776422 unknown
polarizability: 78.3086684|2.8581525|89.1259104|0.|0.|77.6001123 unknown
InChI: InChI=1/9C.9H
charge 1 multiplicity 1
18 atoms
C  0.05373401 -1.29646265 0.74985201
C  0.05373401 -1.29646265 -0.74985201
C  -1.29790208 -0.81045295 0.0000
H  -0.07378375 -2.27652326 1.21724882
H  -0.07378375 -2.27652326 -1.21724882
H  -2.12662047 -1.52074529 0.0000
C  -1.50474134 0.55038143 0.0000
H  -2.51479689 0.96812666 0.0000
C  -0.35287769 1.42127487 0.0000
H  -0.55933258 2.49562426 0.0000
C  0.73537535 1.00700553 0.99835478
H  1.37378571 1.80475074 1.38367691
C  0.76914838 -0.27274489 1.45205672
H  1.37010082 -0.54455996 2.32272352
C  0.73537535 1.00700553 -0.99835478
H  1.37378571 1.80475074 -1.38367691
C  0.76914838 -0.27274489 -1.45205672
H  1.37010082 -0.54455996 -2.32272352
