program: Gaussian 16
title: Title Card Required
version: ES64L-G16RevA.03
frameworkgroup: C3H[SGH(C3H3),X(C6H6)]
method: RPBE1PBE
basis: def2SVP
operation: Freq
keyword: #N
keyword: Geom=AllCheck
keyword: Guess=TCheck
keyword: SCRF=Check
keyword: GenChk
keyword: RPBE1PBE/def2SVP
keyword: Freq
converged: YES YES YES YES
title: Mulliken charges:
elementType: C H C C H H C H C C H H C H C C H H
charge: 0.262239 0.101832 -0.141025 -0.141025 0.125656 0.125656 0.262239 0.101832 -0.141025 -0.141025 0.125656 0.125656 0.262239 0.101832 -0.141025 -0.141025 0.125656 0.125656
chargesum: 1.00000
title: Mulliken charges with hydrogens summed into heavy atoms:
elementType: C C C C C C C C C
charge: 0.364071 -0.015369 -0.015369 0.364071 -0.015369 -0.015369 0.364071 -0.015369 -0.015369
1716.lowfreq: -13.8716 -13.1129 -13.1129 -0.0046 -0.0046 -0.0025 377.8624 431.4040 431.4040
frequency: 377.8624 431.4040 431.4040 495.4956 495.4956 555.7885 555.7885 595.8831 595.8831 598.3903 665.2774 792.5981 792.5981 843.5945 898.7928 912.0970 939.6451 939.6451 952.2797 952.2797 1008.6392 1008.6392 1074.2055 1081.2864 1099.6946 1099.6946 1131.9445 1131.9445 1158.1744 1173.7028 1206.3511 1304.7787 1304.7787 1434.9450 1453.5906 1453.5906 1474.5146 1589.9940 1589.9940 3230.4820 3230.4820 3235.0902 3235.0902 3236.4533 3240.2609 3249.4079 3249.4079 3253.4194
redmass: 3.4005 8.3312 8.3312 1.9912 1.9912 6.7086 6.7086 6.3496 6.3496 1.9036 6.2351 1.6934 1.6934 1.6852 2.5930 5.4546 1.0771 1.0771 3.1202 3.1202 1.4454 1.4454 1.2796 1.2766 1.4734 1.4734 1.0734 1.0734 1.2052 1.3755 1.7483 1.2270 1.2270 3.0198 2.1881 2.1881 2.6920 5.5755 5.5755 1.0919 1.0919 1.0952 1.0952 1.0908 1.0940 1.0989 1.0989 1.1012
irintensity: 0.0000 0.0000 0.0000 0.0179 0.0179 0.0000 0.0000 9.7171 9.7171 0.0000 0.0000 38.1318 38.1317 0.0000 2.2302 0.0000 0.0000 0.0000 12.9305 12.9304 16.2012 16.2014 0.0000 0.0000 8.1679 8.1677 0.0000 0.0000 21.2958 0.0000 60.4040 0.0000 0.0000 0.0000 28.0705 28.0702 5.0905 0.0000 0.0000 0.8573 0.8573 0.0000 0.0000 0.0000 53.8913 54.8669 54.8661 0.0000
temp: 298.150 k
press: 1.00000 atm
elementType: 6 1 6 6 1 1 6 1 6 6 1 1 6 1 6 6 1 1
symmnumber: 3
zpe: 399330.0 jmol-1
zpe.correction: 0.152097 hartree
zpe.thermalcorrener: 0.158103 hartree
zpe.thermalcorrenthalpy: 0.159047 hartree
zpe.thermalcorrgfe: 0.123584 hartree
zpe.sumelectzpe: -347.216110 hartree
zpe.sumelectthermal: -347.210104 hartree
zpe.sumelectthermalent: -347.209160 hartree
zpe.sumelectthermalfe: -347.244623 hartree
dipole: 0.0000 -0.0000 -0.0000
dipole: 0.0000
quadrupole: -42.6477 -42.6477 -34.6280
quadrupole: 0.0000 0.0000 0.0000
quadrupole: -2.6733 -2.6733 5.3465 0.0000 0.0000 0.0000
hfenergy: -347.3682067 hartree
pointgroup: C03H [SGH(C3H3),X(C6H6)]
dipole: 0. 0. 0. debye
dipolederiv: -0.0583155 -0.0000067 0. -0.0000048 -0.269735 0. 0. 0. 0.2059664 0.0582437 0.0000055 0. -0.0000007 0.1745258 0. 0. 0. 0.1181381 0.2694026 -0.0000027 0.0000035 -0.0000024 -0.1175752 0.1693329 -0.000008 0.2143117 -0.1125126 0.2694026 -0.0000027 -0.0000035 -0.0000024 -0.1175752 -0.1693329 0.000008 -0.2143117 -0.1125126 0.1536986 0.0000025 0.0000018 0. 0.075451 0.0104148 -0.0000003 -0.0232153 0.1171266 0.1536986 0.0000025 -0.0000018 0. 0.075451 -0.0104148 0.0000003 0.0232153 0.1171266 -0.2168782 0.0915465 0. 0.0915505 -0.1111723 0. 0. 0. 0.2059664 0.1454556 -0.0503508 0. -0.050352 0.087314 0. 0. 0. 0.1181381 -0.0208292 0.1675677 0.1466456 0.1675667 0.1726566 -0.0846681 0.1855995 -0.1071557 -0.1125126 -0.0208292 0.1675677 -0.1466456 0.1675667 0.1726566 0.0846681 -0.1855995 0.1071557 -0.1125126 0.095013 0.0338824 0.0090196 0.033882 0.1341366 -0.0052073 -0.0201049 0.0116078 0.1171266 0.095013 0.0338824 -0.0090196 0.033882 0.1341366 0.0052073 0.0201049 -0.0116078 0.1171266 -0.2168837 -0.091547 0. -0.0915441 -0.1111668 0. 0. 0. 0.2059657 0.1454573 0.0503537 0. 0.05035 0.0873136 0. 0. 0. 0.1181385 -0.020836 -0.1675651 -0.1466472 -0.1675654 0.1726567 -0.0846637 -0.1855958 -0.1071585 -0.1125137 -0.020836 -0.1675651 0.1466472 -0.1675654 0.1726567 0.0846637 0.1855958 0.1071585 -0.1125137 0.0950138 -0.0338822 -0.0090195 -0.0338836 0.134137 -0.0052065 0.0201061 0.011608 0.1171284 0.0950138 -0.0338822 0.0090195 -0.0338836 0.134137 0.0052065 -0.0201061 -0.011608 0.1171284 unknown
polarizability: 78.8305413|0.0000306|78.8305059|0.|0.|87.2186923 unknown
InChI: InChI=1/9C.9H
charge 1 multiplicity 1
18 atoms
C  0.00000066 1.63213897 0.0000
H  -0.00000626 2.72361896 0.0000
C  0.00000195 0.9146864 1.20211331
C  0.00000195 0.9146864 -1.20211331
H  0.00000444 1.43188252 -2.1638329
H  0.00000444 1.43188252 2.1638329
C  1.41347323 -0.81606963 0.0000
H  2.3587261 -1.36180363 0.0000
C  0.79214044 -0.45734446 1.20211331
C  0.79214044 -0.45734446 -1.20211331
H  1.24004417 -0.71594468 -2.1638329
H  1.24004417 -0.71594468 2.1638329
C  -1.41347389 -0.81606848 0.0000
H  -2.35871983 -1.36181448 0.0000
C  -0.79214239 -0.45734108 1.20211331
C  -0.79214239 -0.45734108 -1.20211331
H  -1.24004861 -0.71593699 -2.1638329
H  -1.24004861 -0.71593699 2.1638329
