program: Gaussian 16
title: Step 1 - PBEPBE-GD3MBJ modQZ
version: ES64L-G16RevC.01
method: RPBEPBE
basis: GenECP
operation: SP
keyword: #P
keyword: #
keyword: PBEPBE/GENECP
keyword: 5D
keyword: 7F
keyword: GEOM=CHECK
keyword: GUESS=READ
keyword: NOSYMM
keyword: INT=ULTRAFINE
keyword: EMPIRICALDISPERSION=GD3BJ
keyword: IOP(3/174=1000000,3/175=358940,3/177=12092,3/178=5938951)
keyword: SCF=(VSHIFT=500,NOSYM,NOVARACC,MAXCYCLE=200,CONVER=5)
keyword: SP
title: #P # PBEPBE/GENECP 5D 7F # GEOM=CHECK # GUESS=READ # NOSYMM # INT=ULTR
basis: NPDir=0 NMtPBC= 1 NCelOv= 1 NCel= 1 NClECP= 1 NCelD= 1
basis: NCelK= 1 NCelE2= 1 NClLst= 1 CellRange= 0.0.
basis: One-electron integrals computed using PRISM.
title: Mulliken charges:
elementType: Ru Cl Cl O N C C C H H C C H H H C H H H C H H H C C C H C H C H C C H H C H C H H H C H C C H C C H C H C C H C H H H C H H H H C H H H C C C C C C H H H H H H
charge: -0.907197 -0.509917 -0.507132 -0.090075 0.022420 0.743797 0.231221 -0.185248 0.064678 0.072904 0.179773 -0.272319 0.121063 0.075021 0.070814 -0.295343 0.086980 0.104926 0.088707 -0.344274 0.101669 0.093591 0.114123 -0.363743 0.132503 -0.080754 0.091269 -0.098008 0.121018 -0.063152 0.089047 0.187069 -0.161143 0.093681 0.137186 -0.207830 0.115869 -0.317004 0.079254 0.090234 0.105615 0.390583 0.117058 -0.108228 -0.024929 0.105657 -0.121351 -0.119879 0.118525 -0.099098 0.089845 0.238108 0.076752 0.114603 -0.282521 0.095239 0.102746 0.128143 -0.302729 0.105455 0.138156 0.090022 0.104974 -0.334787 0.087176 0.112432 0.088643 -0.168592 -0.091685 -0.097453 -0.030813 -0.128261 -0.147609 0.170599 0.077239 0.116569 0.127506 0.128347 0.122267
chargesum: -0.00000
dipole: 0.3143 -0.6377 -0.3138
dipole: 0.7771
quadrupole: -245.3357 -252.9420 -245.3250
quadrupole: -17.1566 6.7147 3.5479
quadrupole: 2.5318 -5.0745 2.5426 -17.1566 6.7147 3.5479
hfenergy: -2425.8945273 hartree
pointgroup: C01 [X(C33H41Cl2N1O1Ru1)]
dipole: 0.1236433 -0.2508796 -0.1234491 debye
InChI: InChI=1/33C.2Cl.N.O.Ru.41H
charge 0 multiplicity 1
79 atoms
Ru -0.45724779 0.91756121 -0.01303578
Cl -2.2184816 -0.58317684 0.33814875
Cl 0.71362489 2.58849114 -1.16534568
O  -2.15735823 2.5070669 0.04800311
N  1.11115058 -1.36712379 -0.84752922
C  0.97037557 -0.3470521 0.04329726
C  2.1864985 -0.38644206 0.99622458
C  3.18209122 -1.29916603 0.2242702
H  3.86474296 -1.8454001 0.90183017
H  3.79643623 -0.66112507 -0.44353727
C  2.32857202 -2.24672551 -0.63122806
C  2.82482795 1.01055644 1.15416931
H  2.91010282 1.50408742 0.16755783
H  3.83881333 0.91354086 1.59132685
H  2.22825634 1.67538624 1.80260017
C  2.99555159 -2.61784643 -1.95539553
H  2.29771168 -3.17003611 -2.61595497
H  3.8623263 -3.27673551 -1.7506638
H  3.36345304 -1.72897747 -2.49723803
C  1.99344282 -3.53559363 0.13961851
H  1.44843815 -3.32924056 1.07823563
H  2.94325779 -4.04203314 0.40459284
H  1.40358913 -4.2381954 -0.47491464
C  0.23281977 -1.45463557 -1.99849991
C  0.47279863 -0.58060214 -3.0973535
C  -0.47761415 -0.54279832 -4.13676443
H  -0.3173962 0.15403912 -4.97280299
C  -1.6046445 -1.36832628 -4.12424347
H  -2.34252081 -1.31133549 -4.93781965
C  -1.78237779 -2.27249505 -3.07386075
H  -2.66296592 -2.93189891 -3.06016799
C  -0.87809458 -2.33793015 -1.99821933
C  1.71145078 0.27688345 -3.24989016
H  2.33584872 0.21643155 -2.33994786
H  1.39977133 1.3382775 -3.30414863
C  -1.15338368 -3.35525848 -0.91475647
H  -2.19523183 -3.21207352 -0.56558361
C  -0.9757669 -4.79882865 -1.410232
H  0.04410632 -4.97806503 -1.80909376
H  -1.68501049 -5.03391059 -2.22951496
H  -1.15464718 -5.52295778 -0.58989116
C  -0.34362248 1.51812402 1.72190965
H  0.36252514 1.11404447 2.47426183
C  -1.2731767 2.51428021 2.20460239
C  -1.2775367 2.97431202 3.54264321
H  -0.53132727 2.56231098 4.23822012
C  -2.21028364 3.92314299 3.97172238
C  -3.15787902 4.42340348 3.06228681
H  -3.89694103 5.16706224 3.39385118
C  -3.18374962 3.99038555 1.72546116
H  -3.93471579 4.39262372 1.03493164
C  -2.24346533 3.04141015 1.30330371
C  -2.99465322 3.00401335 -1.0537919
H  -4.03065135 3.06658466 -0.65519206
C  -2.92673352 1.94432942 -2.14194238
H  -1.89250033 1.85712782 -2.53215314
H  -3.58955694 2.23934307 -2.97893101
H  -3.24213082 0.95671801 -1.75711492
C  -2.48806335 4.36678555 -1.51025591
H  -3.12692089 4.74242274 -2.33470313
H  -1.44535432 4.27025114 -1.86958802
H  -2.5065854 5.11256593 -0.69274774
H  -0.519486 -3.15646495 -0.0342856
C  2.53569067 -0.07718864 -4.4975786
H  2.86592484 -1.13550076 -4.49332505
H  3.43758522 0.56463969 -4.56028743
H  1.95305799 0.07693183 -5.42781489
C  1.81996623 -0.99238384 2.35950819
C  1.22778635 -2.13796166 4.88519276
C  0.53593094 -1.50382187 2.63710216
C  2.80017622 -1.06599302 3.37068625
C  2.50987797 -1.6323717 4.61979988
C  0.24422783 -2.06951873 3.88823711
H  -0.2574163 -1.44005635 1.87698777
H  3.81100597 -0.67490857 3.18164589
H  3.29237547 -1.67732422 5.39172464
H  -0.76804487 -2.45478114 4.07945483
H  0.99787667 -2.58065286 5.86526569
H  -2.20568941 4.27407512 5.01285795
