program: Gaussian 16
title: Step 1 - PBEPBE-GD3MBJ modQZ
version: ES64L-G16RevC.01
method: RPBEPBE
basis: GenECP
operation: SP
keyword: #P
keyword: #
keyword: PBEPBE/GENECP
keyword: 5D
keyword: 7F
keyword: GEOM=CHECK
keyword: GUESS=READ
keyword: NOSYMM
keyword: INT=ULTRAFINE
keyword: EMPIRICALDISPERSION=GD3BJ
keyword: IOP(3/174=1000000,3/175=358940,3/177=12092,3/178=5938951)
keyword: SCF=(VSHIFT=500,NOSYM,NOVARACC,MAXCYCLE=200,CONVER=5)
keyword: SP
title: #P # PBEPBE/GENECP 5D 7F # GEOM=CHECK # GUESS=READ # NOSYMM # INT=ULTR
basis: NPDir=0 NMtPBC= 1 NCelOv= 1 NCel= 1 NClECP= 1 NCelD= 1
basis: NCelK= 1 NCelE2= 1 NClLst= 1 CellRange= 0.0.
basis: One-electron integrals computed using PRISM.
title: Mulliken charges:
elementType: Ru O C H C C H C H C H C H C C H C H H H C H H H Cl Cl P C H C H H C H H C H C H C H H C H H C H H C H H C H H C H H C H H C H H C H H C H H C H H C H H C H H
charge: -0.999680 -0.064837 0.302921 0.100945 -0.193289 -0.060069 0.109019 -0.123299 0.134156 -0.135268 0.122644 -0.066519 0.097598 0.271703 0.056195 0.161603 -0.298265 0.115835 0.120198 0.088523 -0.297981 0.108884 0.137478 0.084859 -0.567293 -0.554252 2.098273 -0.348984 0.097140 -0.227992 0.103127 0.099511 -0.194417 0.062923 0.118265 -0.295382 0.059158 -0.430324 0.144406 -0.166790 0.067198 0.112252 -0.210747 0.087190 0.134190 -0.172826 0.105847 0.053502 -0.208538 0.145806 0.087010 -0.190644 0.110211 0.074870 -0.194086 0.073771 0.106017 -0.224337 0.138803 0.110433 -0.197703 0.082421 0.108819 -0.153907 0.110191 0.059379 -0.175052 0.107523 0.099661 -0.197369 0.068538 0.103937 -0.176401 0.086563 0.111543 -0.190666 0.113235 0.062641
chargesum: -0.00000
dipole: 7.1834 -1.8905 5.0778
dipole: 8.9977
quadrupole: -242.9125 -232.8569 -255.7966
quadrupole: 5.2845 -24.6741 9.7454
quadrupole: 0.9428 10.9984 -11.9413 5.2845 -24.6741 9.7454
hfenergy: -2524.4450116 hartree
pointgroup: C01 [X(C28H45Cl2O1P1Ru1)]
dipole: 2.8261601 -0.7437626 1.99778 debye
InChI: InChI=1/28C.2Cl.O.P.Ru.45H
charge 0 multiplicity 1
78 atoms
Ru -0.78407481 0.33955746 -2.07509504
O  1.43076072 0.23604079 -2.47682457
C  -0.59433716 -1.44440121 -2.45275952
H  -1.46852226 -2.11307252 -2.6135118
C  0.72856753 -1.98755008 -2.71894121
C  0.99614111 -3.35829753 -2.93452544
H  0.15176921 -4.06354108 -2.93125346
C  2.30597256 -3.80798558 -3.13662767
H  2.50613917 -4.87655566 -3.29692024
C  3.36401756 -2.88472908 -3.13738509
H  4.39608784 -3.2287764 -3.29517725
C  3.12833868 -1.51251389 -2.93692256
H  3.96932584 -0.81145128 -2.9363187
C  1.81495743 -1.07233587 -2.73404486
C  2.18447587 1.40345479 -3.02169789
H  1.41745315 2.19069054 -2.89837936
C  3.39433977 1.73004136 -2.15480135
H  3.12717865 1.71730334 -1.07997558
H  3.73709423 2.75490768 -2.40252544
H  4.25190935 1.0479389 -2.31169482
C  2.45433535 1.245207 -4.50750456
H  2.86284118 2.20167704 -4.89133591
H  1.50373353 1.04371587 -5.03591843
H  3.18455842 0.44553752 -4.73558125
Cl -0.99260975 1.91112932 -3.79580503
Cl -3.09997273 0.27198344 -1.82113295
P  -0.5336877 0.16004759 0.20022022
C  -1.84615624 -0.77725942 1.14427957
H  -2.74523449 -0.17690899 0.88127563
C  1.74413244 0.20084739 2.04183165
H  1.67071045 1.30670012 2.04273594
H  1.1459164 -0.15908455 2.90617746
C  3.21463867 -0.21114221 2.22531584
H  3.81860341 0.2485474 1.40971798
H  3.60575887 0.2041744 3.17749564
C  -0.68441483 1.92943014 0.82877769
H  -0.32075158 1.91362835 1.88040511
C  1.18634052 -0.39080699 0.7345975
H  1.80748447 0.00001916 -0.10050609
C  3.39350174 -1.73390257 2.18581483
H  2.87823761 -2.18311107 3.06510813
H  4.46703179 -1.99861152 2.2828969
C  1.33331958 -1.92319918 0.73002952
H  0.74184956 -2.34850778 1.5697613
H  0.92156521 -2.35104021 -0.2034273
C  2.80393288 -2.32761072 0.9010339
H  2.89327997 -3.43372878 0.90266064
H  3.38037382 -1.96858719 0.01936835
C  -2.11840747 -2.19057973 0.60464598
H  -2.28502138 -2.13280651 -0.48739741
H  -1.24198203 -2.84945092 0.77878624
C  -2.90187623 -1.38457735 3.3558106
H  -2.75366546 -1.40272236 4.45590711
H  -3.78151343 -0.72970406 3.16460233
C  -1.66914096 -0.77219726 2.67133058
H  -0.76983257 -1.36642359 2.94513354
H  -1.49657493 0.25712214 3.04895966
C  -2.12951853 2.45724834 0.82461916
H  -2.55212622 2.37248053 -0.19922524
H  -2.77200966 1.83102866 1.47574135
C  -3.35058915 -2.78858191 1.29835209
H  -4.24387687 -2.18707901 1.0179177
H  -3.53296341 -3.81691488 0.92270317
C  -3.1954274 -2.79323436 2.82450985
H  -4.10602593 -3.20455086 3.30784079
H  -2.35656956 -3.47042727 3.10594352
C  0.23576553 2.84712795 0.00017684
H  -0.08756366 2.80814483 -1.06625236
H  1.28119148 2.47533933 0.02423418
C  0.17289208 4.30032188 0.48808674
H  0.57672156 4.35808925 1.52488262
H  0.82866301 4.93614152 -0.14255935
C  -1.26847695 4.82136394 0.47096572
H  -1.63403108 4.84278891 -0.57971698
H  -1.3087118 5.86535226 0.84522206
C  -2.18243002 3.91553498 1.30393806
H  -3.23024148 4.27833833 1.26540228
H  -1.87017048 3.96515897 2.37252879
