program: Gaussian 16
title: Step 1 - PBEPBE-GD3MBJ modQZ
version: ES64L-G16RevC.01
method: RPBEPBE
basis: Gen
operation: SP
keyword: #P
keyword: #
keyword: PBEPBE/GEN
keyword: 5D
keyword: 7F
keyword: GEOM=CHECK
keyword: GUESS=READ
keyword: NOSYMM
keyword: INT=ULTRAFINE
keyword: EMPIRICALDISPERSION=GD3BJ
keyword: IOP(3/174=1000000,3/175=358940,3/177=12092,3/178=5938951)
keyword: SCF=(VSHIFT=500,NOSYM,NOVARACC,MAXCYCLE=200,CONVER=5)
keyword: #SP
title: #P # PBEPBE/GEN 5D 7F # GEOM=CHECK # GUESS=READ # NOSYMM # INT=ULTRAFI
basis: NPDir=0 NMtPBC= 1 NCelOv= 1 NCel= 1 NClECP= 1 NCelD= 1
basis: NCelK= 1 NCelE2= 1 NClLst= 1 CellRange= 0.0.
basis: One-electron integrals computed using PRISM.
basis: NBasis= 1524 RedAO= T EigKep= 4.07D-06 NBF= 1524
basis: NBsUse= 1524 1.00D-06 EigRej= -1.00D+00 NBFU= 1524
title: Mulliken charges:
elementType: P C C C C C C C C C C C C C C C C C C H H H H H H H H H H H H H H H
charge: 0.628197 -0.123693 -0.244535 -0.110901 -0.110670 -0.244736 -0.244824 -0.111551 -0.118864 -0.111291 -0.110825 -0.118903 -0.123618 -0.123588 -0.105718 -0.118720 -0.110621 -0.105642 -0.105647 0.120042 0.122463 0.111657 0.111578 0.120269 0.111562 0.122553 0.120300 0.120095 0.120156 0.130837 0.120286 0.122646 0.130865 0.130841
chargesum: -0.00000
dipole: -0.0029 1.3971 0.0033
dipole: 1.3971
quadrupole: -110.4916 -118.5075 -110.4330
quadrupole: 0.0159 0.0130 -0.0119
quadrupole: 2.6524 -5.3635 2.7110 0.0159 0.0130 -0.0119
hfenergy: -1035.5992221 hartree
pointgroup: C01 [X(C18H15P1)]
dipole: -0.0011567 0.5496555 0.0013115 debye
InChI: InChI=1/18C.P.15H
charge 0 multiplicity 1
34 atoms
P  0.0013377 -1.47092297 0.00025932
C  3.16239635 1.06319681 -1.05107833
C  -1.44916638 -0.62951521 -0.79649143
C  1.8214313 -1.16252903 -2.09833105
C  2.09854126 0.4894356 -0.33742493
C  0.03546268 -0.62785486 1.65395097
C  1.4154707 -0.62742102 -0.85729524
C  -1.34196406 0.48917067 -1.64579974
C  2.87470242 -0.57925786 -2.81574553
C  -0.75108751 0.49364803 1.98236866
C  -2.72601765 -1.16780227 -0.52979464
C  0.99475582 -0.58402081 3.90003742
C  -0.66589013 1.06762959 3.26043736
C  -2.49259096 1.06155913 -2.21032929
C  -3.76004972 0.52980052 -1.92832532
C  -3.87465037 -0.58601632 -1.08336311
C  0.90108083 -1.16731539 2.62906606
C  0.20826546 0.53456765 4.21986111
C  3.55034103 0.53471797 -2.29160824
H  3.68968309 1.93427362 -0.63432154
H  1.30096648 -2.04431943 -2.50322471
H  1.79381796 0.91179986 0.63076035
H  -0.35178537 0.91398442 -1.86429621
H  3.17666263 -1.00256489 -3.78511844
H  -1.43241286 0.91930955 1.23186039
H  -2.81517238 -2.051005 0.12164946
H  1.67833267 -1.01084595 4.64876292
H  -1.28629406 1.94236978 3.50624439
H  -2.39652769 1.93410877 -2.87359449
H  -4.65973094 0.98129485 -2.37132736
H  -4.86444893 -1.01186846 -0.86200997
H  1.50774485 -2.05266217 2.38313341
H  0.27347873 0.9872607 5.2200319
H  4.38351706 0.98729411 -2.84884415
