program: Gaussian 16
title: Step 5 - GeomOpt (TS) PBEPBE-GD3MBJ modDZ
version: ES64L-G16RevC.01
method: RPBEPBE
basis: Gen
operation: Freq
keyword: #P
keyword: #
keyword: PBEPBE/CHKBASIS
keyword: GEOM=CHECK
keyword: GUESS=READ
keyword: NOSYMM
keyword: INT=ULTRAFINE
keyword: EMPIRICALDISPERSION=GD3BJ
keyword: IOP(3/174=1000000,3/175=358940,3/177=12092,3/178=5938951)
keyword: CPHF=(GRID=FINEGRID)
keyword: SCF=(VSHIFT=300,CONVER=9,NOSYM,MAXCYCLE=250,NOVARACC)
keyword: FREQ
title: #P # PBEPBE/CHKBASIS # GEOM=CHECK # GUESS=READ # NOSYMM # INT=ULTRAFIN
converged: YES YES YES YES
title: Mulliken charges:
elementType: H C H C H H Ru C H H Cl Cl P C H C H H C H H C H C H C H H C H H C H H C H H C H H C H H C H H C H H C H H C H H C H H C H H C H H
charge: 0.204158 -0.190301 0.035969 0.037378 0.078175 0.065663 -0.296456 0.023754 0.090923 0.068041 -0.285420 -0.232272 0.185898 -0.203023 0.020082 0.005299 0.017313 0.051036 -0.008489 0.012903 0.011118 -0.207089 0.051193 -0.202716 0.029814 -0.018991 0.024653 0.009130 -0.010249 0.082900 0.028665 -0.006524 0.011177 0.011944 0.002570 0.021891 0.061369 0.010375 0.017861 0.014061 -0.040879 0.136072 0.038923 0.009264 0.030270 0.053792 -0.008126 0.011212 0.012458 -0.021603 0.009512 0.028809 0.009646 0.031910 0.016866 -0.007288 0.022520 0.010128 -0.023258 0.015706 0.012196 -0.008223 0.008794 0.027517
chargesum: -0.00000
title: Mulliken charges with hydrogens summed into heavy atoms:
elementType: C C Ru C Cl Cl P C C C C C C C C C C C C C C C C C C
charge: 0.049827 0.181216 -0.296456 0.182718 -0.285420 -0.232272 0.185898 -0.182941 0.073648 0.015532 -0.155895 -0.172902 0.014791 0.101316 0.016597 0.085830 0.042297 0.134115 0.093326 0.015544 0.016718 0.058422 0.025359 0.004644 0.028088
chargesum: 0.00000
polarizability: 3.18866326e+02 -4.71095313e+00 3.26391655e+02 -3.50194838e-01 5.97672275e+00 3.38326267e+02
1716.lowfreq: -225.3401 -8.0191 -0.0020 -0.0016 -0.0009 5.3065 8.0015 10.5713 37.6462
frequency: -225.3397 7.3131 37.6123 45.2933 59.7279 64.5187 67.9243 75.7313 81.8398 88.2344 100.9919 108.1031 122.8359 146.1167 158.1875 168.5496 169.9479 183.2571 195.4486 202.1437 214.6633 225.0250 240.7044 242.4954 246.5492 265.8077 291.5101 296.4093 311.4099 317.1418 325.3347 330.1822 365.2743 379.3071 399.1325 401.1802 427.2749 433.3751 435.2413 437.4416 440.4753 462.0030 477.9857 496.3042 502.7312 513.5810 591.5028 688.9971 704.9169 716.9411 733.1190 736.1713 769.8969 772.1298 774.3504 778.4700 813.1665 815.7197 820.0865 839.0394 840.5145 842.4255 855.4266 873.8813 879.1752 879.8030 886.0583 890.4791 896.0019 905.3857 908.2440 913.7691 916.0721 950.1161 979.7366 980.9644 985.4655 990.4899 1025.4546 1029.7795 1033.5984 1035.0194 1039.4223 1042.5618 1043.7487 1055.7558 1058.3944 1061.9975 1080.8386 1091.3478 1092.0017 1093.1194 1094.7223 1103.9482 1140.4567 1155.4118 1156.6556 1163.9965 1168.3168 1174.4051 1187.7150 1191.7637 1234.2747 1236.4156 1238.9081 1241.1419 1244.4572 1250.4550 1251.6158 1255.0680 1258.4790 1266.3971 1273.9989 1275.0369 1301.0616 1302.9970 1304.5789 1311.8309 1312.4668 1316.0797 1318.7628 1322.8084 1323.5679 1328.9907 1330.2011 1332.0414 1332.5947 1333.5476 1335.2295 1348.9335 1384.9233 1395.6215 1399.9973 1400.7734 1401.5104 1403.8744 1404.7794 1405.2579 1406.7955 1408.8097 1411.5730 1414.3726 1415.4530 1424.2337 1428.3522 1428.7924 1461.9018 1663.7579 2866.9384 2941.6563 2942.1068 2942.5167 2943.0599 2944.7730 2946.6657 2947.8553 2950.0144 2953.1043 2954.8816 2955.5204 2955.5691 2960.3602 2977.4233 2983.8021 2986.0058 2986.3385 2987.5391 3005.5308 3005.7860 3006.7320 3006.8554 3006.9319 3008.3706 3009.4178 3011.3833 3012.4535 3013.2078 3026.2372 3033.5489 3036.4956 3037.6684 3040.0807 3060.7848 3067.3271 3121.2213 3177.6465
redmass: 1.4132 4.1962 4.3525 3.8121 3.5702 4.8769 4.3682 3.6651 3.0071 3.3156 6.1486 7.6835 10.0776 3.9315 3.2580 3.9680 4.4996 4.0695 4.9535 3.1879 3.3760 2.8358 2.4462 2.6567 1.9826 2.2063 9.0347 3.8257 2.4663 1.9686 1.9211 5.4291 2.1558 2.9240 2.5688 3.7620 2.8237 2.5101 2.8437 2.5694 2.8532 2.3696 5.2709 1.6202 1.7899 2.2819 3.6807 1.2866 2.3013 2.5383 2.2921 1.1780 1.4370 1.4426 1.4501 1.1594 2.3833 2.2357 2.6646 1.7744 1.7644 1.6893 1.2010 1.3969 1.3770 1.3885 2.2394 2.4214 2.3618 1.1274 2.1231 2.1362 2.1528 1.2230 1.8506 1.9749 2.0646 2.2550 1.6655 1.6412 1.6305 1.3781 1.2835 1.1523 1.1453 1.2890 1.2750 1.2249 1.8359 2.2270 2.3860 2.3389 2.5667 2.2179 1.3454 1.4703 1.5342 1.5334 1.4979 1.4252 1.3902 1.8059 1.3054 1.3168 1.3051 1.2695 1.2645 1.2474 1.2608 1.2333 1.3192 1.2325 1.2414 1.2078 1.3460 1.3774 1.3599 1.4561 1.4683 1.4555 1.4436 1.4555 1.4582 1.5226 1.5088 1.5553 1.5444 1.4701 1.4500 1.2884 1.0964 1.0910 1.0950 1.0906 1.0971 1.0912 1.0989 1.0868 1.0815 1.0953 1.0894 1.0973 1.2661 1.1048 1.0977 1.0968 2.4980 1.0261 1.0739 1.0694 1.0673 1.0733 1.0680 1.0676 1.0705 1.0774 1.0672 1.0611 1.0656 1.0618 1.0618 1.0650 1.0627 1.0620 1.0831 1.0708 1.0770 1.0948 1.0940 1.0947 1.0941 1.0928 1.0946 1.1006 1.1024 1.1028 1.1025 1.0548 1.1020 1.1021 1.0901 1.0999 1.0930 1.0567 1.1159 1.1166
irintensity: 19.4460 0.0636 0.3273 0.0438 0.1713 0.6116 0.1357 0.7094 0.2183 0.3866 3.3930 0.7184 13.3388 0.2884 0.1636 3.2465 2.3038 3.5882 2.4026 0.1087 0.6536 0.0805 2.8134 4.3627 0.1289 0.2714 2.8448 6.4258 0.9231 0.0960 0.1716 9.8640 8.0884 4.3810 5.9405 5.9937 2.9878 1.2886 1.0982 3.2490 0.8807 14.0635 7.5238 11.5386 6.6507 10.4811 7.7890 347.1399 53.3311 31.0514 28.7555 39.2007 0.5667 0.2839 0.8099 59.5148 7.9978 2.0389 5.9205 3.4827 3.1828 8.1731 16.8930 2.6420 3.3498 0.4689 3.3431 1.8766 4.2423 1.6056 0.5365 0.7843 0.8554 10.6133 4.3426 7.4539 3.4618 17.2042 1.1538 2.0419 3.7636 1.8685 0.4461 37.8131 141.1405 3.3755 2.6682 2.8282 9.2769 0.5158 0.3402 5.1417 0.4566 10.6548 2.3721 2.3088 7.0596 2.1028 2.0360 25.3966 3.4887 5.3793 2.3989 0.6488 0.4464 2.2431 0.9523 5.3341 0.9556 3.0771 9.9399 2.4171 1.6643 1.4886 2.0989 1.7438 0.3300 1.1714 1.0355 2.0414 0.9715 4.8494 2.5860 1.5930 2.5283 0.2254 0.7040 3.8461 4.0655 1.5759 1.2776 0.6460 0.3609 0.0866 4.7504 5.3369 1.4582 3.2955 20.0267 4.4561 5.8421 6.4671 6.4257 2.2671 0.5715 0.8752 10.1849 66.5303 52.0319 9.5715 27.2572 20.1705 26.6213 26.9200 37.1602 9.0289 27.4894 32.4102 3.3589 24.3132 22.5556 30.1151 4.3117 17.0693 6.6795 16.4401 2.8724 40.9452 54.1007 96.8644 71.5205 16.8725 40.3445 0.9302 37.1000 35.1047 63.0464 13.6538 18.8060 8.6519 3.3987 22.5433 5.8671 4.5988 3.8943 1.8321
temp: 298.150 k
press: 1.00000 atm
elementType: 1 6 1 6 1 1 44 6 1 1 17 17 15 6 1 6 1 1 6 1 1 6 1 6 1 6 1 1 6 1 1 6 1 1 6 1 1 6 1 1 6 1 1 6 1 1 6 1 1 6 1 1 6 1 1 6 1 1 6 1 1 6 1 1
symmnumber: 1
zpe: 1438316.8 jmol-1
zpe.correction: 0.547826 hartree
zpe.thermalcorrener: 0.577013 hartree
zpe.thermalcorrenthalpy: 0.577957 hartree
zpe.thermalcorrgfe: 0.487698 hartree
zpe.sumelectzpe: -2178.128571 hartree
zpe.sumelectthermal: -2178.099384 hartree
zpe.sumelectthermalent: -2178.098440 hartree
zpe.sumelectthermalfe: -2178.188699 hartree
dipole: -1.9247 1.9565 1.5843
dipole: 3.1690
quadrupole: -195.3829 -198.3702 -193.6811
quadrupole: 7.5111 1.3422 2.9669
quadrupole: 0.4285 -2.5588 2.1303 7.5111 1.3422 2.9669
hfenergy: -2178.676397 hartree
pointgroup: C01 [X(C21H39Cl2P1Ru1)]
dipole: -0.7572469 0.7697528 0.6233244 debye
polarizability: 318.8663256|-4.7109531|326.3916547|-0.3501948|5.9767228|338.3262666 unknown
InChI: InChI=1/21C.2Cl.P.Ru.39H
charge 0 multiplicity 1
64 atoms
H  0.16903636 -1.12153505 -3.6277156
C  0.16998218 -2.75422287 -3.53746963
H  -0.38441821 -2.4864972 -4.46225728
C  -0.53815465 -2.86824923 -2.26652125
H  -0.23777005 -3.67977164 -1.58201879
H  -1.61666292 -2.63755147 -2.26910319
Ru 0.82106074 -1.28853581 -2.09265495
C  1.58927509 -2.85232262 -3.55341498
H  2.11485801 -3.53123645 -2.86940576
H  2.12092511 -2.55113445 -4.4695339
Cl 2.04050045 -2.59851462 -0.54299475
Cl -0.02756967 0.50346531 -3.59589943
P  0.21277847 -0.03011071 -0.15426542
C  1.66012619 1.11293427 0.25963229
H  1.24418336 2.01829547 0.75709466
C  -1.05445316 2.4849117 -0.88083544
H  -0.24421559 3.01444579 -0.34030978
H  -0.72647877 2.37508361 -1.93410688
C  -2.34038053 3.32480964 -0.83458405
H  -2.62057639 3.51073911 0.22761196
H  -2.15318993 4.31994019 -1.2892434
C  -0.07619095 -1.00080002 1.42503061
H  0.92267198 -1.45965413 1.58490657
C  -1.2982388 1.0934866 -0.26978055
H  -1.58945618 1.2516991 0.79328278
C  -3.49954339 2.61566702 -1.54546072
H  -3.25355426 2.50980622 -2.62581172
H  -4.42316505 3.22857249 -1.48790786
C  -2.46072502 0.37436309 -0.98098388
H  -2.16489568 0.18049708 -2.03280132
H  -2.64553849 -0.61556064 -0.51813409
C  -3.73884674 1.22453547 -0.9465898
H  -4.55319168 0.70072475 -1.48930145
H  -4.08206137 1.33344762 0.10771545
C  2.71413159 0.4835243 1.18923057
H  2.27011572 0.22571426 2.17084921
H  3.06961728 -0.46808228 0.74009733
C  3.51133116 2.4589503 -0.87133081
H  3.96623062 2.70729643 -1.85253356
H  3.14732929 3.41948612 -0.44045688
C  2.31298313 1.52433975 -1.07679426
H  2.66316247 0.59274067 -1.5917881
H  1.5715655 1.98381537 -1.75773552
C  -1.06758114 -2.16358555 1.26291843
H  -2.09280883 -1.76619954 1.09379006
H  -0.79379912 -2.76305647 0.37518605
C  3.90127172 1.43564489 1.40055755
H  3.55022918 2.35116781 1.92974201
H  4.64755197 0.95471995 2.06661243
C  4.54856195 1.83925209 0.07098245
H  5.38819397 2.54415027 0.24407027
H  4.98522344 0.93580878 -0.41081278
C  -0.43497785 -0.15088779 2.6551807
H  -1.45153086 0.28330395 2.52849023
H  0.26056721 0.7058201 2.77167367
C  -0.42813441 -1.02128276 3.92241329
H  0.60619233 -1.39251787 4.1000799
H  -0.70015997 -0.40699029 4.806167
C  -1.38134668 -2.21563195 3.78227304
H  -2.42744414 -1.83771489 3.71934213
H  -1.33358296 -2.85547274 4.68800674
C  -1.06800264 -3.03777633 2.52535739
H  -1.79702737 -3.86726963 2.4132563
H  -0.06548302 -3.50959459 2.62960672
