program: Gaussian 16
title: Title Card Required
version: ES64L-G16RevC.01
method: RCAM-B3LYP
basis: 6-31G(d)
operation: Freq
keyword: #N
keyword: Geom=AllCheck
keyword: Guess=TCheck
keyword: SCRF=Check
keyword: GenChk
keyword: RCAM-B3LYP/6-31G(d)Freq
converged: YES YES NO YES
title: Mulliken charges:
elementType: C H C C H H C H C C H H C H C C H H
charge: 0.062475 0.236156 -0.226258 -0.226258 0.243605 0.243605 0.062444 0.236159 -0.226234 -0.226234 0.243601 0.243601 0.062444 0.236159 -0.226234 -0.226234 0.243601 0.243601
chargesum: 1.00000
title: Mulliken charges with hydrogens summed into heavy atoms:
elementType: C C C C C C C C C
charge: 0.298631 0.017347 0.017347 0.298603 0.017368 0.017368 0.298603 0.017368 0.017368
1716.lowfreq: -0.0009 -0.0006 0.0007 11.7082 13.3577 15.0025 351.0237 351.0388 388.1856
frequency: 351.0235 351.0388 388.1856 498.1331 498.2647 554.5833 554.6686 568.4726 568.4901 616.2280 671.1437 800.4627 800.5161 858.9170 882.8840 907.6722 954.7229 954.7369 966.7784 966.8143 1025.1866 1025.2299 1094.5923 1098.1246 1116.5969 1116.6856 1158.7877 1163.0412 1163.0514 1191.5487 1210.2791 1348.4402 1348.4458 1447.3519 1482.3131 1482.3603 1495.4470 1597.3727 1597.4139 3251.8744 3251.8856 3257.2636 3259.3659 3259.3895 3266.5516 3266.6256 3266.6436 3272.4619
redmass: 8.5081 8.5093 3.4563 1.9774 1.9772 6.9117 6.9121 7.9045 7.9153 1.9713 6.3705 1.6492 1.6497 1.6675 3.1698 5.4936 1.0793 1.0793 3.1099 3.1063 1.4660 1.4668 1.2719 1.2557 1.5298 1.5298 2.0521 1.0902 1.0903 1.4963 1.0955 1.2214 1.2215 2.5508 1.9984 1.9987 2.2619 5.0249 5.0255 1.0898 1.0898 1.0894 1.0943 1.0943 1.0926 1.0985 1.0985 1.0996
irintensity: 0.0000 0.0000 0.0000 0.5479 0.5422 0.0000 0.0000 11.0644 11.0706 0.0000 0.0000 32.5088 32.4997 0.0000 0.0055 0.0000 0.0000 0.0000 12.4011 12.3514 14.5736 14.5995 0.0000 0.0000 11.6208 11.6061 72.2931 0.0006 0.0000 0.0000 11.4300 0.0000 0.0000 0.0000 24.5093 24.5016 8.1582 0.0000 0.0000 7.9948 7.9306 0.0000 0.0000 0.0000 26.8728 25.0942 25.1593 0.0001
temp: 298.150 k
press: 1.00000 atm
elementType: 6 1 6 6 1 1 6 1 6 6 1 1 6 1 6 6 1 1
symmnumber: 1
zpe: 402113.1 jmol-1
zpe.correction: 0.153157 hartree
zpe.thermalcorrener: 0.159291 hartree
zpe.thermalcorrenthalpy: 0.160235 hartree
zpe.thermalcorrgfe: 0.123484 hartree
zpe.sumelectzpe: -347.656253 hartree
zpe.sumelectthermal: -347.650119 hartree
zpe.sumelectthermalent: -347.649175 hartree
zpe.sumelectthermalfe: -347.685926 hartree
dipole: 0.0000 -0.0001 -0.0000
dipole: 0.0001
quadrupole: -42.2425 -42.2420 -34.4023
quadrupole: -0.0000 0.0000 -0.0000
quadrupole: -2.6135 -2.6131 5.2267 -0.0000 0.0000 -0.0000
hfenergy: -347.8094099 hartree
pointgroup: CS [SG(C3H3),X(C6H6)]
dipole: 0. -0.0000233 0. debye
dipolederiv: -0.0699584 0. 0. 0. -0.2261567 0. 0. 0. 0.2233081 0.0554108 0. 0. 0. 0.1371842 0. 0. 0. 0.1130726 0.2757186 0. 0. 0. -0.0988293 0.2075549 0. 0.2430763 -0.094147 0.2757186 0. 0. 0. -0.0988293 -0.2075549 0. -0.2430763 -0.094147 0.1484743 0. 0. 0. 0.0597596 0.0217104 0. -0.0114069 0.0926238 0.1484743 0. 0. 0. 0.0597596 -0.0217104 0. 0.0114069 0.0926238 -0.1870501 0.0676146 0. 0.0676112 -0.1089983 0. 0. 0. 0.2232796 0.1167511 -0.0354155 0. -0.0354198 0.0758615 0. 0. 0. 0.1130749 -0.0052481 0.1622063 0.1797391 0.1622258 0.1820591 -0.1037564 0.2105599 -0.1215449 -0.0941217 -0.0052481 0.1622063 -0.1797391 0.1622258 0.1820591 0.1037564 -0.2105599 0.1215449 -0.0941217 0.0819381 0.0384104 0.0187958 0.0384157 0.1262873 -0.0108572 -0.0098712 0.0057 0.0926109 0.0819381 0.0384104 -0.0187958 0.0384157 0.1262873 0.0108572 0.0098712 -0.0057 0.0926109 -0.1870501 -0.0676146 0. -0.0676112 -0.1089983 0. 0. 0. 0.2232796 0.1167511 0.0354155 0. 0.0354197 0.0758615 0. 0. 0. 0.1130749 -0.0052481 -0.1622063 -0.1797391 -0.1622258 0.1820591 -0.1037564 -0.2105599 -0.1215449 -0.0941217 -0.0052481 -0.1622063 0.1797391 -0.1622258 0.1820591 0.1037564 0.2105599 0.1215449 -0.0941217 0.0819381 -0.0384104 -0.0187958 -0.0384157 0.1262873 -0.0108572 0.0098712 0.0057 0.0926109 0.0819381 -0.0384104 0.0187958 -0.0384157 0.1262873 0.0108572 -0.0098712 -0.0057 0.0926109 unknown
polarizability: 74.6758102|0.|74.6764185|0.|0.|85.3817161 unknown
InChI: InChI=1/9C.9H
charge 1 multiplicity 1
18 atoms
C  -0.0000 1.63174056 0.0000
H  -0.0000 2.71586884 0.0000
C  0.0000 0.92008228 1.20048342
C  -0.0000 0.92008228 -1.20048342
H  -0.0000 1.42856246 -2.15704614
H  0.0000 1.42856246 2.15704614
C  1.41312788 -0.81587436 0.0000
H  2.35200618 -1.35794691 0.0000
C  0.79679338 -0.46003329 1.20047617
C  0.79679337 -0.46003329 -1.20047617
H  1.23713896 -0.71428005 -2.15704174
H  1.23713896 -0.71428005 2.15704174
C  -1.41312788 -0.81587436 -0.0000
H  -2.35200618 -1.35794691 -0.0000
C  -0.79679338 -0.46003329 1.20047617
C  -0.79679338 -0.46003329 -1.20047617
H  -1.23713896 -0.71428005 -2.15704174
H  -1.23713896 -0.71428005 2.15704174
