program: Gaussian 09
title: 000051605
version: EM64L-G09RevD.01
frameworkgroup: C1[X(C17H19NO4)]
method: RPBEPBE
basis: SDD
operation: Freq
keyword: #p
keyword: freq=noraman
keyword: PBEPBE/SDD
title: #p freq=noraman PBEPBE/SDD
converged: YES YES NO NO
title: Mulliken charges:
elementType: O O O O N C C C C C C C C C C C C C C C C C H H H H H H H H H H H H H H H H H H H
charge: -0.287721 -0.308945 -0.302810 -0.299129 -0.363825 -0.261179 -0.410570 0.356404 0.320929 -0.353601 -0.328221 -0.360358 -0.360211 0.343971 0.294998 -0.360267 -0.384797 -0.216286 -0.206303 -0.193751 -0.254345 -0.674136 0.212631 0.222182 0.236040 0.250838 0.251186 0.249295 0.259669 0.265364 0.337368 0.264436 0.256277 0.226224 0.225729 0.226787 0.228967 0.229331 0.210327 0.228545 0.228955
chargesum: 0.00000
title: Mulliken charges with hydrogens summed into heavy atoms:
elementType: O O O O N C C C C C C C C C C C C C C C C C
charge: -0.287721 -0.308945 -0.302810 -0.299129 -0.026458 0.173634 0.076309 0.356404 0.320929 -0.102415 -0.078925 -0.100689 -0.094848 0.343971 0.294998 -0.095831 -0.128519 0.235667 0.020483 0.035216 -0.025014 -0.006308
polarizability: 3.04368033e+02 -1.23346725e+01 1.70723340e+02 4.53435033e+00 -1.46924512e+01 1.61083995e+02
1716.lowfreq: -12.4218 -4.7767 -0.0008 -0.0005 0.0008 0.6185 10.0732 18.3162 20.6221
frequency: 8.9021 17.9076 20.5188 24.5862 39.6528 50.1900 53.9025 82.2274 101.6735 114.8279 147.3273 152.9016 172.7989 206.3878 220.6115 246.4723 279.8041 315.1078 327.2059 344.3015 360.9547 409.7945 417.5638 426.4930 441.3168 483.1281 493.6153 503.1835 567.1979 589.4856 610.5032 612.7998 631.5365 669.7576 690.7468 700.1959 702.1076 722.1980 759.6793 773.7969 800.2423 805.4983 826.1470 832.9659 834.3958 851.8302 871.4610 902.3261 916.4123 933.2867 954.3883 967.2423 983.1088 985.2366 985.7787 997.5056 1019.4690 1038.9096 1040.0821 1078.0576 1094.5919 1108.7196 1110.0015 1139.5346 1141.8616 1151.5038 1167.7498 1171.6805 1181.4702 1195.9421 1203.5229 1210.6180 1235.3373 1248.3092 1269.9506 1292.4649 1308.9358 1353.5955 1359.9614 1369.4739 1380.0345 1387.6610 1397.6974 1420.0160 1442.7155 1456.3477 1462.4103 1464.4574 1471.3254 1476.2944 1484.6860 1489.9589 1498.7839 1588.1184 1595.9732 1606.9172 1620.0342 1659.8035 2964.2789 2994.7211 2998.5463 3007.0412 3035.5721 3064.5327 3080.8106 3091.5927 3105.9850 3129.8669 3139.0061 3149.9045 3156.2087 3156.8379 3164.5767 3169.6399 3174.0733 3177.9495 3576.1853
redmass: 4.0962 3.4857 4.0393 4.0239 5.0729 4.0041 4.8833 4.6941 3.3990 4.8814 4.1024 3.1843 6.5101 4.1903 4.8435 1.2065 5.9177 2.7534 5.2487 3.7125 5.7799 2.9291 3.0546 4.0326 4.3811 3.3642 3.0408 2.7659 4.7410 4.5400 1.6973 2.5160 6.6960 4.5485 2.3913 10.0466 4.4883 3.4499 1.7432 3.7963 1.0949 1.3105 3.3315 1.4442 1.4146 5.3696 2.8221 1.4235 3.6690 1.3524 1.3404 1.3600 2.7413 1.4885 3.8640 2.6856 2.0990 2.8229 3.0981 1.5015 2.0160 1.2672 2.2889 1.4678 3.9794 2.0291 1.1059 1.1316 1.6132 2.1609 2.3380 1.1395 5.6206 1.1341 1.2795 1.2973 1.3388 1.3192 1.5958 2.2044 1.9461 5.7070 1.2649 3.7920 2.3335 1.0864 1.0407 1.2393 1.9842 1.0839 1.4660 1.7197 1.5483 7.3273 6.6847 6.6365 6.4369 9.4896 1.0557 1.0357 1.0672 1.0580 1.1047 1.1068 1.0988 1.0985 1.1025 1.0849 1.0891 1.0879 1.0927 1.0882 1.0961 1.0961 1.1004 1.0975 1.0773
irintensity: 0.0027 0.4197 1.1966 0.8283 1.6129 0.7950 2.2809 2.7629 6.6135 2.2840 2.5521 1.8504 5.5058 8.9180 1.3029 0.7143 6.2027 1.8022 8.0427 3.8365 6.2852 0.8075 0.7225 4.5289 5.3265 10.6643 13.3308 24.8134 1.5578 2.3909 97.4545 83.2811 0.1012 13.7304 31.1654 20.8744 3.9025 13.6110 84.5015 12.1190 4.1492 7.2888 7.0217 31.8669 40.8038 54.7431 21.7904 5.7712 61.4364 0.6742 0.1277 0.1565 35.7225 0.0705 1.1278 17.5145 14.0817 69.5061 129.2739 10.3575 65.3137 18.5527 15.3734 4.9526 117.1761 4.0263 7.1855 6.5566 258.6573 484.7256 279.2343 1.6131 54.0999 0.0582 118.1168 3.5360 3.0004 5.3923 9.5113 12.2484 1.7225 8.1690 28.8352 2.0083 1.3841 40.2220 9.0999 250.6623 134.2105 45.9841 218.7535 161.1595 132.5975 2.4968 27.5817 50.0638 22.9004 318.7549 35.9512 22.7660 21.5903 27.3357 58.7797 10.9511 5.3258 34.1442 48.4862 2.3981 11.6817 21.5189 25.1507 5.7983 13.7455 8.0752 9.2200 2.2762 43.5018
temp: 298.150 k
press: 1.00000 atm
elementType: 8 8 8 8 7 6 6 6 6 6 6 6 6 6 6 6 6 6 6 6 6 6 1 1 1 1 1 1 1 1 1 1 1 1 1 1 1 1 1 1 1
symmnumber: 1
zpe: 859358.3 jmol-1
zpe.correction: 0.327312 hartree
zpe.thermalcorrener: 0.348711 hartree
zpe.thermalcorrenthalpy: 0.349656 hartree
zpe.thermalcorrgfe: 0.271065 hartree
zpe.sumelectzpe: -1013.234536 hartree
zpe.sumelectthermal: -1013.213137 hartree
zpe.sumelectthermalent: -1013.212193 hartree
zpe.sumelectthermalfe: -1013.290783 hartree
dipole: -0.4223 0.9575 -0.1013
dipole: 1.0513
quadrupole: -128.6972 -122.2293 -129.1546
quadrupole: 1.6904 15.0990 -0.4206
quadrupole: -2.0035 4.4644 -2.4609 1.6904 15.0990 -0.4206
hfenergy: -1013.5618484 hartree
pointgroup: C01 [X(C17H19N1O4)]
dipole: -0.1891153 0.3669278 -0.0262048 debye
polarizability: 305.0599867|-3.7125077|171.1014314|8.7147031|-13.970327|160.0139497 unknown
InChI: InChI=1S/C17H19NO4/c1-2-20-17(19)18-12-13-21-14-8-10-16(11-9-14)22-15-6-4-3-5-7-15/h3-11,18H,2,12-13H2,1H3
charge 0 multiplicity 1
41 atoms
O  1.682431 -1.42392 0.156882
O  -3.912092 -1.060784 0.740173
O  5.684102 1.316594 0.677129
O  5.965794 0.440729 -1.497506
N  4.379392 -0.420883 0.010729
C  2.347184 -1.250697 -1.148223
C  3.842235 -1.443358 -0.887544
C  0.282393 -1.286323 0.206748
C  -2.508312 -1.055329 0.524168
C  -0.305979 -1.488758 1.479825
C  -0.531447 -0.975174 -0.910508
C  -1.698531 -1.37066 1.639148
C  -1.931097 -0.864706 -0.749276
C  -4.746099 -0.086336 0.136423
C  5.387174 0.433969 -0.37788
C  -4.308495 1.220081 -0.186359
C  -6.093084 -0.469749 -0.052666
C  6.772745 2.293667 0.394844
C  -5.239715 2.143051 -0.713661
C  -7.011068 0.464861 -0.577536
C  -6.590063 1.773575 -0.914547
C  6.90699 3.167088 1.638564
H  1.977216 -2.012829 -1.864328
H  2.14415 -0.236216 -1.545395
H  4.004232 -2.452645 -0.462719
H  4.399497 -1.373138 -1.837886
H  0.340207 -1.735495 2.327484
H  -0.09983 -0.826153 -1.904342
H  -2.171606 -1.525627 2.613076
H  -2.564841 -0.641504 -1.613252
H  3.970821 -0.310905 0.939513
H  -3.268168 1.514873 -0.017725
H  -6.397048 -1.485817 0.216315
H  6.499865 2.877978 -0.502724
H  7.699393 1.734187 0.171345
H  -4.905821 3.157193 -0.960368
H  -8.055606 0.168876 -0.724868
H  -7.304628 2.495469 -1.323641
H  7.706785 3.914765 1.486397
H  5.965031 3.703008 1.846598
H  7.16389 2.55804 2.522193
