program: Gaussian 16
title: INUGIJ@Br R1R2=F, [FeII-FeII-Br] HS-LS
version: ES64L-G16RevB.01
method: UTPSSh
basis: Gen
operation: Freq
keyword: #p
keyword: UTPSSh/GEN
keyword: SCF=(DIRECT,TIGHT,XQC,FERMI)
keyword: POP=FULL
keyword: 5D
keyword: 7F
keyword: GFINPUT
keyword: GFOLDPRINT
keyword: NOFMM
keyword: NOSYMM
keyword: SCFCYC=500
keyword: FREQ
keyword: GUESS=CHECK
keyword: GEOM=CHECK
title: #p UTPSSh/GEN SCF=(DIRECT,TIGHT,XQC,FERMI) POP=FULL 5D 7F GFINPUT GFOL
basis: NPDir=0 NMtPBC= 1 NCelOv= 1 NCel= 1 NClECP= 1 NCelD= 1
basis: NCelK= 1 NCelE2= 1 NClLst= 1 CellRange= 0.0.
basis: One-electron integrals computed using PRISM.
basis: NBasis= 2142 RedAO= T EigKep= 6.08D-06 NBF= 2142
basis: NBsUse= 2142 1.00D-06 EigRej= -1.00D+00 NBFU= 2142
converged: YES YES NO YES
polarizability: 8.86314653e+02 9.69696276e-01 1.38404224e+03 -4.42832535e-01 -4.05190505e+00 9.05097378e+02
1716.lowfreq: -1.5117 -0.0048 -0.0029 0.0053 0.7785 2.4601 14.5175 15.6632 16.2105
temp: 298.150 k
press: 1.00000 atm
elementType: 26 26 7 7 7 1 7 1 7 7 7 7 7 1 7 1 7 7 7 7 7 1 7 1 7 7 6 1 6 1 6 6 1 6 6 6 6 6 6 1 6 1 6 1 6 6 1 6 6 6 6 6 1 6 6 1 6 1 6 1 6 1 6 6 1 6 6 6 6 6 6 1 6 1 6 1 6 6 1 6 6 6 6 6 1 6 6 1 6 1 6 1 6 1 6 6 1 6 6 6 6 6 6 1 6 1 6 1 6 6 1 6 6 6 6 6 1 6 6 1 6 1 35 9 9 9 9 9 9 9 9 9 9 9 9
symmnumber: 1
zpe: 2453585.0 jmol-1
zpe.correction: 0.934521 hartree
zpe.thermalcorrener: 1.016030 hartree
zpe.thermalcorrenthalpy: 1.016974 hartree
zpe.thermalcorrgfe: 0.811907 hartree
zpe.sumelectzpe: -9822.189091 hartree
zpe.sumelectthermal: -9822.107582 hartree
zpe.sumelectthermalent: -9822.106638 hartree
zpe.sumelectthermalfe: -9822.311705 hartree
hfenergy: -9823.1236124 hartree
pointgroup: C01 [X(C66H36Br1F12Fe2N18)]
dipole: 0.0179649 0.1859766 0.0074816 debye
polarizability: 886.3146529|0.9696963|1384.0422417|-0.4428325|-4.051905|905.097378 unknown
InChI: InChI=1S/3C22H12F4N6.Br.2Fe/c3*23-13-4-6-27-15(9-13)21-17(25)19(29-31-21)11-2-1-3-12(8-11)20-18(26)22(32-30-20)16-10-14(24)5-7-28-16;;;/h3*1-10,29-30H;;;/q3*-3;;+3;+6
charge 3 multiplicity 5
135 atoms
Fe -0.01985166 4.8345354 -0.04241443
Fe -0.00408176 -4.86520275 0.03632575
N  1.41116539 5.93037798 -0.96584093
N  1.59670648 3.81838852 0.47409012
N  1.88801057 2.72576414 1.19698852
H  1.14585852 2.0790245 1.44268346
N  2.02217137 -2.5294935 1.17789938
H  1.71197941 -1.84720915 0.48883557
N  1.37713476 -3.70367754 1.26431605
N  0.35972334 -6.08393002 1.88388142
N  -1.52979331 5.92487989 -0.8376401
N  -0.38353287 3.79517043 -1.68631996
N  0.09760065 2.69535762 -2.2866837
H  0.67583123 2.05161811 -1.75699536
N  -0.00242811 -2.55755914 -2.33432802
H  -0.44897834 -1.86730747 -1.73415845
N  0.37051314 -3.73272634 -1.80766497
N  1.4185357 -6.09608028 -1.18479089
N  0.05279043 5.95300772 1.6442516
N  -1.26582176 3.81947161 1.11281489
N  -2.02853859 2.71892435 1.01817883
H  -1.86224412 2.06153677 0.26326734
N  -2.05064402 -2.53909824 1.21027398
H  -1.3010991 -1.85412865 1.28157599
N  -1.79969767 -3.71838476 0.62360189
N  -1.80607768 -6.08033091 -0.57341632
C  1.23026545 6.98869361 -1.77765261
H  0.2067443 7.27475638 -1.97229102
C  2.27089304 7.70446499 -2.34695515
H  2.0827424 8.55171303 -2.99321452
C  3.56657881 7.30169734 -2.05024497
C  3.80188195 6.21193192 -1.22438935
H  4.81110077 5.89338478 -0.99902164
C  2.69616404 5.54999251 -0.7034763
C  2.77566152 4.37398273 0.13707732
C  3.81176522 3.59060017 0.66353564
C  3.23449221 2.51407423 1.32304977
C  3.81153857 1.3174524 1.93867104
C  5.04246131 1.34991268 2.60846934
H  5.59025001 2.27888096 2.70846745
C  5.5564161 0.1798506 3.15903972
H  6.50507616 0.20859112 3.68123003
C  4.87395364 -1.02795608 3.04622024
H  5.29998757 -1.92784158 3.47199636
C  3.6485033 -1.07233472 2.36710649
C  3.12685841 0.10598396 1.82758018
H  2.1793582 0.08077638 1.30180501
C  2.90263718 -2.31969494 2.1953764
C  2.82540822 -3.48559247 2.95122144
C  1.86704806 -4.31756818 2.35814992
C  1.30051125 -5.60708162 2.73773198
C  1.6659529 -6.27206534 3.90414495
H  2.42219076 -5.8825717 4.57230543
C  1.01759276 -7.4655167 4.19045129
C  0.0354819 -7.9682305 3.34717571
H  -0.47671982 -8.89428758 3.57288468
C  -0.24845577 -7.23821558 2.20345959
H  -0.9997893 -7.589416 1.50752065
C  -2.13951602 6.99318615 -0.29097555
H  -1.79685932 7.29190002 0.6891569
C  -3.14938756 7.70374341 -0.91909756
H  -3.61266979 8.55941545 -0.44573726
C  -3.53987551 7.2844705 -2.18431186
C  -2.94536631 6.18400375 -2.78467152
H  -3.25446284 5.85262934 -3.76724326
C  -1.94464082 5.5284806 -2.07683965
C  -1.25970514 4.34357237 -2.54870752
C  -1.31845838 3.54804876 -3.70109843
C  -0.46165273 2.47158983 -3.51578172
C  -0.2153654 1.26601828 -4.30943128
C  -0.24265241 1.28399214 -5.71072505
H  -0.42451551 2.20781729 -6.2460064
C  -0.02176396 0.10568562 -6.41722998
H  -0.03748004 0.12295505 -7.5002526
C  0.21392611 -1.09597878 -5.75563829
H  0.36955936 -2.00252 -6.32710309
C  0.23070214 -1.12603034 -4.35427653
C  0.02437261 0.06085536 -3.6467846
H  0.03625131 0.04749185 -2.56304381
C  0.44380105 -2.36671886 -3.60808408
C  1.12429524 -3.54343257 -3.90259569
C  1.06937395 -4.3645777 -2.76770991
C  1.66802167 -5.6544451 -2.44452828
C  2.46553864 -6.35723158 -3.34207445
H  2.65435655 -5.99583385 -4.34398227
C  3.02353852 -7.55107368 -2.90536624
C  2.80019668 -8.01947406 -1.61716135
H  3.24194278 -8.94518477 -1.27259253
C  1.98519035 -7.25197634 -0.80021928
H  1.77469285 -7.57083526 0.21250315
C  0.83567368 7.02226503 1.88025944
H  1.5141269 7.30449972 1.08822139
C  0.80006042 7.7534085 3.0564529
H  1.44533058 8.60906372 3.20598693
C  -0.10190327 7.35488029 4.03456695
C  -0.92367248 6.25424748 3.83915978
H  -1.62116585 5.93890005 4.60390308
C  -0.8139751 5.57713087 2.63017387
C  -1.56977861 4.38909416 2.2941092
C  -2.53778053 3.60657498 2.93806105
C  -2.81031413 2.51609922 2.12337993
C  -3.6237619 1.31662194 2.33188571
C  -4.81859505 1.3518669 3.06403199
H  -5.18419713 2.28426956 3.47634004
C  -5.54521044 0.17990056 3.25052378
H  -6.47117741 0.2106857 3.81186698
C  -5.099824 -1.03231419 2.73154251
H  -5.67599586 -1.93347477 2.90051494
C  -3.8998795 -1.0794002 2.00847852
C  -3.178945 0.10064853 1.80986191
H  -2.25070171 0.07353253 1.2509825
C  -3.37361357 -2.33110377 1.46263549
C  -3.9850851 -3.50325132 1.02915758
C  -2.98777191 -4.33704632 0.50637635
C  -3.02003829 -5.6295822 -0.16877797
C  -4.2010282 -6.32070509 -0.4178082
H  -5.16177413 -5.95049515 -0.08601023
C  -4.10762644 -7.51523412 -1.119437
C  -2.88141485 -7.99281994 -1.5624378
H  -2.80768707 -8.9191535 -2.11676179
C  -1.76110295 -7.23564704 -1.25638819
H  -0.77961149 -7.56513754 -1.57260482
Br -0.02124875 0.00162457 -0.00163322
F  -0.17836276 8.02809066 5.17338495
F  -3.06340434 3.84016163 4.13690811
F  -5.28967006 -3.76381512 1.07229555
F  -5.21175161 -8.20273511 -1.37422289
F  3.78773943 -8.24768404 -3.73416082
F  1.33988548 -8.1279563 5.2926233
F  3.51685836 -3.74158278 4.05959624
F  1.74497601 -3.81888614 -5.04783848
F  -2.09358331 3.75955703 -4.76055586
F  -4.49638286 7.93745424 -2.82828865
F  5.11447415 3.81137257 0.51457691
F  4.59495139 7.96027421 -2.5647278
