program: Gaussian 16
title: INUGIJ@Cl R1R2=CH3, [FeII-FeII-Cl] HS-HS
version: ES64L-G16RevB.01
method: UTPSSh
basis: Gen
operation: Freq
keyword: #p
keyword: UTPSSh/GEN
keyword: SCF=(DIRECT,TIGHT,XQC,FERMI)
keyword: POP=FULL
keyword: 5D
keyword: 7F
keyword: GFINPUT
keyword: GFOLDPRINT
keyword: NOFMM
keyword: NOSYMM
keyword: SCFCYC=500
keyword: FREQ
keyword: GUESS=CHECK
keyword: GEOM=CHECK
title: #p UTPSSh/GEN SCF=(DIRECT,TIGHT,XQC,FERMI) POP=FULL 5D 7F GFINPUT GFOL
basis: NPDir=0 NMtPBC= 1 NCelOv= 1 NCel= 1 NClECP= 1 NCelD= 1
basis: NCelK= 1 NCelE2= 1 NClLst= 1 CellRange= 0.0.
basis: One-electron integrals computed using PRISM.
basis: NBasis= 2344 RedAO= T EigKep= 5.76D-06 NBF= 2344
basis: NBsUse= 2344 1.00D-06 EigRej= -1.00D+00 NBFU= 2344
converged: YES YES NO YES
polarizability: 1.04565575e+03 2.10741618e+00 1.54217895e+03 1.89421957e+01 -3.06165249e-01 1.06409447e+03
1716.lowfreq: -1.7154 -0.0011 0.0015 0.0023 0.9718 2.3549 11.8938 12.0373 12.7512
temp: 298.150 k
press: 1.00000 atm
elementType: 26 26 7 7 7 1 7 1 7 7 7 7 7 1 7 1 7 7 7 7 7 1 7 1 7 7 6 1 6 1 6 6 1 6 6 6 6 6 6 1 6 1 6 1 6 6 1 6 6 6 6 6 1 6 6 1 6 1 6 1 6 1 6 6 1 6 6 6 6 6 6 1 6 1 6 1 6 6 1 6 6 6 6 6 1 6 6 1 6 1 6 1 6 1 6 6 1 6 6 6 6 6 6 1 6 1 6 1 6 6 1 6 6 6 6 6 1 6 6 1 6 1 17 6 1 1 1 6 1 1 1 6 1 1 1 6 1 1 1 6 1 1 1 6 1 1 1 6 1 1 1 6 1 1 1 6 1 1 1 6 1 1 1 6 1 1 1 6 1 1 1
symmnumber: 1
zpe: 3574871.0 jmol-1
zpe.correction: 1.361596 hartree
zpe.thermalcorrener: 1.454817 hartree
zpe.thermalcorrenthalpy: 1.455761 hartree
zpe.thermalcorrgfe: 1.220671 hartree
zpe.sumelectzpe: -6988.750262 hartree
zpe.sumelectthermal: -6988.657041 hartree
zpe.sumelectthermalent: -6988.656097 hartree
zpe.sumelectthermalfe: -6988.891187 hartree
hfenergy: -6990.1118581 hartree
pointgroup: C01 [X(C78H72Cl1Fe2N18)]
dipole: -0.0015083 0.000257 -0.0020603 debye
polarizability: 1045.6557479|2.1074162|1542.1789481|18.9421957|-0.3061652|1064.0944667 unknown
InChI: InChI=1S/3C26H24N6.Cl.2Fe/c3*1-15-8-10-27-21(12-15)25-17(3)23(29-31-25)19-6-5-7-20(14-19)24-18(4)26(32-30-24)22-13-16(2)9-11-28-22;;;/h3*5-14,29-30H,1-4H3;;;/q-4;2*-2;;2*+4
charge 3 multiplicity 9
171 atoms
Fe -0.02304624 4.88820769 -0.06343021
Fe 0.00123974 -4.88204966 0.04435535
N  1.68075159 6.02256631 -0.96755442
N  1.79728811 3.75895938 0.33719302
N  2.07523493 2.63398435 1.00357503
H  1.32219484 1.99013673 1.22839301
N  2.04788605 -2.61538525 1.18611478
H  1.83639567 -1.98718801 0.41768919
N  1.38159578 -3.76860543 1.2924279
N  0.23431361 -6.04525167 1.92607041
N  -1.62880385 6.055591 -1.06566151
N  -0.59036497 3.76779007 -1.83085289
N  -0.21969853 2.61119914 -2.38748297
H  0.38669044 1.98211501 -1.87131522
N  -0.0743696 -2.64013759 -2.318458
H  -0.59275974 -1.99223515 -1.73247866
N  0.40525856 -3.76706587 -1.78288557
N  1.52605784 -6.03570422 -1.12115261
N  -0.09224481 6.08556083 1.80176876
N  -1.25491403 3.77810501 1.31184189
N  -1.95099905 2.63627736 1.26639804
H  -1.78271618 1.98258915 0.50740364
N  -1.99350374 -2.60751205 1.23076933
H  -1.22961962 -1.95612343 1.38627283
N  -1.75345874 -3.75321006 0.5824232
N  -1.73202724 -6.06988146 -0.66291784
C  1.54809681 7.15521701 -1.67221907
H  0.53187096 7.48485711 -1.85279177
C  2.62383748 7.8872782 -2.14988478
H  2.44526051 8.79648308 -2.71168019
C  3.92437067 7.44948089 -1.88619542
C  4.05993215 6.2654091 -1.15568122
H  5.04821554 5.89522297 -0.92242585
C  2.93516506 5.56721509 -0.72257789
C  2.98589705 4.3008389 0.01764564
C  4.04772716 3.48236206 0.47123875
C  3.41308297 2.41115448 1.11077331
C  3.92839026 1.20988572 1.77805468
C  5.13240156 1.22846905 2.49566643
H  5.69228699 2.14847653 2.60308447
C  5.60270749 0.06543581 3.09484622
H  6.54489252 0.08155175 3.62976219
C  4.87814887 -1.11835578 3.01439776
H  5.28211196 -2.02157493 3.45286871
C  3.64432887 -1.14305225 2.34916084
C  3.18923903 0.02356873 1.72555781
H  2.24341004 0.00870067 1.19120882
C  2.84203197 -2.36838909 2.26466116
C  2.67136771 -3.44799159 3.13714168
C  1.75771366 -4.30007663 2.4692478
C  1.15278158 -5.58933192 2.8168663
C  1.48045058 -6.31925457 3.95790979
H  2.23912883 -5.95064803 4.63371099
C  0.84580361 -7.53307426 4.23421588
C  -0.11336465 -7.97228193 3.31691008
H  -0.64484802 -8.90413882 3.46953817
C  -0.37716866 -7.20977273 2.19083755
H  -1.10763349 -7.53615662 1.46059551
C  -2.11803048 7.22483831 -0.62546497
H  -1.75365597 7.55594789 0.33940075
C  -3.03140287 7.98647227 -1.33580348
H  -3.38613448 8.92248124 -0.9208491
C  -3.47267154 7.5407781 -2.58519977
C  -2.96362912 6.32210075 -3.04137546
H  -3.26789327 5.94827418 -4.00876671
C  -2.06210581 5.59383219 -2.26735054
C  -1.49962886 4.30025995 -2.66671164
C  -1.72719182 3.44531615 -3.77319981
C  -0.86785395 2.36288113 -3.5592472
C  -0.61335857 1.13390922 -4.31907257
C  -0.69687601 1.10587295 -5.71825189
H  -0.91968478 2.00879058 -6.27175747
C  -0.4703321 -0.08094139 -6.40599359
H  -0.55830835 -0.09957868 -7.48581665
C  -0.13117076 -1.2438694 -5.72376234
H  0.00272068 -2.16602608 -6.27432304
C  0.01201439 -1.22233337 -4.32947927
C  -0.24574588 -0.03277245 -3.64031308
H  -0.15925035 -0.01529643 -2.55745463
C  0.39304119 -2.42373373 -3.57766327
C  1.23338845 -3.50124819 -3.88104634
C  1.1920275 -4.3166496 -2.72494445
C  1.83306708 -5.58675211 -2.36421826
C  2.69186957 -6.294567 -3.20179582
H  2.89696034 -5.92927789 -4.19812475
C  3.28887838 -7.48212172 -2.76881316
C  2.97954584 -7.91347514 -1.47626293
H  3.40728615 -8.82499969 -1.07586948
C  2.10086427 -7.17186557 -0.70206791
H  1.83598356 -7.49666648 0.29709088
C  0.56141853 7.23810136 2.01113116
H  1.20281187 7.57089617 1.20366607
C  0.44270466 7.98429006 3.17243686
H  1.00036126 8.90771842 3.27528491
C  -0.41170042 7.54396714 4.18738607
C  -1.08960218 6.34183369 3.96944944
H  -1.7677852 5.97136612 4.72484985
C  -0.90372203 5.62561297 2.78816624
C  -1.54784481 4.33861712 2.50088224
C  -2.4315771 3.51492664 3.23857443
C  -2.67190738 2.42078111 2.39908828
C  -3.47631383 1.20432937 2.56354335
C  -4.67077155 1.20534623 3.29723461
H  -5.04788953 2.12285969 3.72993584
C  -5.39176945 0.02696812 3.45405406
H  -6.30219235 0.03023252 4.04158835
C  -4.95779722 -1.15558953 2.86563577
H  -5.51199921 -2.06975805 3.03426523
C  -3.79718337 -1.16316664 2.07950079
C  -3.0604648 0.01851655 1.94957396
H  -2.14749762 0.01520179 1.36071965
C  -3.32166362 -2.38444703 1.41891285
C  -3.99277293 -3.47732498 0.85779362
C  -2.96035535 -4.30834728 0.36066359
C  -2.96314084 -5.59843866 -0.33894244
C  -4.12008757 -6.30646454 -0.65997841
H  -5.08643212 -5.92646692 -0.3607471
C  -4.04528743 -7.5122938 -1.36178203
C  -2.77007544 -7.96461944 -1.71298444
H  -2.63847047 -8.89146972 -2.25879769
C  -1.65905943 -7.22584769 -1.33959593
H  -0.66037125 -7.56772925 -1.58423647
Cl -0.01119186 0.00302257 -0.00697846
C  -0.57669931 8.31494221 5.46479807
H  -1.50151815 8.04793803 5.97727252
H  0.25631261 8.09884969 6.14175284
H  -0.57424572 9.39049654 5.27952523
C  -4.46652412 8.32413444 -3.39225925
H  -4.42666791 8.0544247 -4.44815317
H  -5.48078618 8.12134049 -3.0328498
H  -4.29574328 9.39761712 -3.29519127
C  -2.93646426 3.69596212 4.63759277
H  -2.12331839 3.9680085 5.3140227
H  -3.705078 4.47230518 4.70259626
H  -3.3665345 2.76864032 5.01400203
C  -2.72418961 3.59186178 -4.88193157
H  -3.69675974 3.90171453 -4.4936029
H  -2.40830871 4.32758526 -5.62829759
H  -2.87236552 2.64141718 -5.39361702
C  -5.47636987 -3.65144384 0.741145
H  -5.75889129 -3.92079032 -0.27889032
H  -5.85579349 -4.42705863 1.41356598
H  -5.9924052 -2.72214982 0.97908374
C  -5.28135674 -8.27479867 -1.74141308
H  -6.13203363 -7.99413521 -1.11952536
H  -5.54403016 -8.06559471 -2.78356504
H  -5.12243255 -9.35122823 -1.65624618
C  1.16500744 -8.31780407 5.47319536
H  2.1475857 -8.05895273 5.8692004
H  0.42393761 -8.1042966 6.25055123
H  1.13358341 -9.39139044 5.28000299
C  3.25922645 -3.59418592 4.50751133
H  2.49826268 -3.90318675 5.2273182
H  4.06872621 -4.3304861 4.53455007
H  3.66217697 -2.64383665 4.85626636
C  5.52027304 3.65004249 0.2518565
H  5.73549798 3.8816402 -0.79361849
H  5.9411536 4.44968831 0.86917333
H  6.05202097 2.72970224 0.49014791
C  5.12368088 8.20136352 -2.38580065
H  6.01452436 7.96759196 -1.80174659
H  5.32612988 7.93114041 -3.42742656
H  4.95494954 9.27907031 -2.35590366
C  2.05179247 -3.67728383 -5.12359044
H  3.08829363 -3.91828129 -4.87755654
H  1.66232165 -4.47381067 -5.76509737
H  2.06835358 -2.75739411 -5.70679146
C  4.23923357 -8.24414822 -3.64597076
H  4.07989314 -8.01711879 -4.70071391
H  5.2716805 -7.97610763 -3.39852888
H  4.13760122 -9.32041261 -3.49741304
