program: Gaussian 16
title: INUGIJ@Cl, [FeII-FeII-Cl] LS-LS
version: ES64L-G16RevB.01
method: UTPSSh
basis: Gen
operation: Freq
keyword: #p
keyword: UTPSSh/GEN
keyword: SCF=(DIRECT,TIGHT,XQC,FERMI)
keyword: POP=FULL
keyword: 5D
keyword: 7F
keyword: GFINPUTGFOLDPRINT
keyword: NOFMM
keyword: NOSYMM
keyword: SCFCYC=500
keyword: FREQ
keyword: GUESS=CHECK
keyword: GEOM=CHECK
title: #p UTPSSh/GEN SCF=(DIRECT,TIGHT,XQC,FERMI) POP=FULL 5D 7F GFINPUT GFOL
basis: NPDir=0 NMtPBC= 1 NCelOv= 1 NCel= 1 NClECP= 1 NCelD= 1
basis: NCelK= 1 NCelE2= 1 NClLst= 1 CellRange= 0.0.
basis: One-electron integrals computed using PRISM.
basis: NBasis= 1972 RedAO= T EigKep= 6.07D-06 NBF= 1972
basis: NBsUse= 1972 1.00D-06 EigRej= -1.00D+00 NBFU= 1972
converged: YES YES NO YES
polarizability: 8.91574293e+02 -2.40394580e-01 1.32389938e+03 -1.26123286e-01 -3.94115939e+00 8.91936430e+02
1716.lowfreq: -1.5566 -0.0024 0.0020 0.0025 0.8380 2.2097 19.8636 20.1287 22.6355
temp: 298.150 k
press: 1.00000 atm
elementType: 26 26 7 7 7 1 7 1 7 7 7 7 7 1 7 1 7 7 7 7 7 1 7 1 7 7 6 1 6 1 6 1 6 1 6 6 6 1 6 6 6 1 6 1 6 1 6 6 1 6 6 1 6 6 6 1 6 1 6 1 6 1 6 1 6 1 6 1 6 1 6 6 6 1 6 6 6 1 6 1 6 1 6 6 1 6 6 1 6 6 6 1 6 1 6 1 6 1 6 1 6 1 6 1 6 1 6 6 6 1 6 6 6 1 6 1 6 1 6 6 1 6 6 1 6 6 6 1 6 1 6 1 6 1 17
symmnumber: 1
zpe: 2726005.9 jmol-1
zpe.correction: 1.038281 hartree
zpe.thermalcorrener: 1.106162 hartree
zpe.thermalcorrenthalpy: 1.107106 hartree
zpe.thermalcorrgfe: 0.937918 hartree
zpe.sumelectzpe: -6517.091310 hartree
zpe.sumelectthermal: -6517.023428 hartree
zpe.sumelectthermalent: -6517.022484 hartree
zpe.sumelectthermalfe: -6517.191673 hartree
hfenergy: -6518.1295906 hartree
pointgroup: C01 [X(C66H48Cl1Fe2N18)]
dipole: 0.0008351 0.0058349 0.0008302 debye
polarizability: 891.5742929|-0.2403946|1323.8993786|-0.1261233|-3.9411594|891.9364298 unknown
InChI: InChI=1S/3C22H16N6.Cl.2Fe/c3*1-3-10-23-17(8-1)21-13-19(25-27-21)15-6-5-7-16(12-15)20-14-22(28-26-20)18-9-2-4-11-24-18;;;/h3*1-14,25-26H;;;/q3*-4;;2*+6
charge 3 multiplicity 1
135 atoms
Fe -0.01790705 4.789516 -0.04829279
Fe -0.01210231 -4.7840803 0.03946516
N  1.3739422 5.87918183 -1.02528295
N  1.60731969 3.7638733 0.37604338
N  1.91213297 2.64349665 1.05132069
H  1.17395231 1.99373303 1.30374052
N  1.98511252 -2.61845367 0.96558962
H  1.75645453 -1.97294623 0.21595725
N  1.26797063 -3.74455212 1.11306857
N  0.00814234 -5.86747186 1.7440253
N  -1.55252703 5.87947375 -0.78064269
N  -0.46992612 3.74410718 -1.65337348
N  -0.04506845 2.61255973 -2.23926992
H  0.53824682 1.96596967 -1.71724179
N  -0.19215403 -2.64640521 -2.18291555
H  -0.71894331 -1.98729373 -1.61792097
N  0.28550349 -3.76855817 -1.62001629
N  1.44554438 -5.89019094 -0.81586224
N  0.12276114 5.90353106 1.63062951
N  -1.18897978 3.76990268 1.16104275
N  -1.91586657 2.64184409 1.1033186
H  -1.76005872 1.98303459 0.34664407
N  -1.83067277 -2.61686957 1.27806446
H  -1.07260641 -1.9625434 1.44575907
N  -1.59046653 -3.74984085 0.59780738
N  -1.48977914 -5.89026483 -0.78099336
C  1.16056863 6.94663855 -1.81576327
H  0.1291909 7.23191738 -1.9659792
C  2.18821437 7.66528485 -2.41061361
H  1.95164329 8.51657687 -3.03605519
C  3.50488099 7.27770689 -2.18224274
H  4.32869833 7.8222714 -2.62764385
C  3.74400583 6.17245319 -1.37613929
H  4.75368292 5.83417311 -1.18012753
C  2.66617797 5.49236251 -0.81598462
C  2.78212 4.29888573 0.00129275
C  3.84911945 3.50123609 0.4460258
H  4.90332096 3.65025801 0.28185369
C  3.26036627 2.42714718 1.09993161
C  3.82681813 1.21148479 1.69215421
C  5.07252897 1.21210678 2.33187429
H  5.6417341 2.1299888 2.42182754
C  5.57052867 0.03218714 2.87699217
H  6.53335062 0.03753635 3.3736955
C  4.84809969 -1.15453761 2.79240129
H  5.25947099 -2.06696389 3.20816163
C  3.60478983 -1.1677935 2.14817994
C  3.10629249 0.01848838 1.60586098
H  2.14194004 0.01314371 1.10865364
C  2.80471503 -2.39106445 2.03492968
C  2.62285382 -3.46363182 2.89767579
H  3.10189866 -3.60519149 3.85212728
C  1.64860349 -4.27198669 2.28938431
C  0.92541953 -5.46997904 2.67352915
C  1.10049026 -6.14458726 3.878662
H  1.84332825 -5.79774863 4.58591037
C  0.31435013 -7.25537361 4.15558338
H  0.43433335 -7.79589343 5.08674008
C  -0.63271193 -7.65379038 3.21735355
H  -1.27239688 -8.50971307 3.39067224
C  -0.75073124 -6.94011497 2.03285916
H  -1.46957592 -7.23379481 1.28141175
C  -2.12332988 6.9590409 -0.21613624
H  -1.73581043 7.25572832 0.74795514
C  -3.14761501 7.67581582 -0.81899259
H  -3.56526044 8.53725492 -0.31368704
C  -3.61094511 7.2732183 -2.06768735
H  -4.40509655 7.81584551 -2.56617018
C  -3.03967123 6.15557403 -2.6618336
H  -3.37701225 5.80547595 -3.62927034
C  -2.02003904 5.47834964 -1.99875788
C  -1.37813939 4.27364243 -2.49091162
C  -1.53182197 3.46119989 -3.62616507
H  -2.19987433 3.60325325 -4.45924939
C  -0.67840448 2.38404999 -3.42820313
C  -0.45694226 1.15591912 -4.19758327
C  -0.52356019 1.13730329 -5.59623532
H  -0.7224566 2.04898936 -6.14747312
C  -0.3082387 -0.05415471 -6.28285812
H  -0.3578026 -0.06382329 -7.36508773
C  -0.03007585 -1.23335239 -5.59768453
H  0.11847839 -2.15478157 -6.14859765
C  0.03143585 -1.22724823 -4.19865467
C  -0.18150782 -0.02955372 -3.51315036
H  -0.13208348 -0.01963911 -2.42935051
C  0.32381517 -2.44177718 -3.43146467
C  1.15202338 -3.52552088 -3.69112859
H  1.73617375 -3.68520476 -4.58206493
C  1.10745653 -4.31657708 -2.53153298
C  1.7925933 -5.51389456 -2.08127783
C  2.74223395 -6.20672325 -2.82708325
H  2.98398207 -5.87651705 -3.82948913
C  3.36792263 -7.31399433 -2.26940683
H  4.10921997 -7.86845729 -2.8321335
C  3.02858358 -7.69057039 -0.9736436
H  3.49325537 -8.54276664 -0.49439333
C  2.06827053 -6.95960993 -0.28820609
H  1.77664819 -7.23622383 0.71483803
C  0.90449751 6.98071753 1.82670135
H  1.54829019 7.26027444 1.00511327
C  0.89879061 7.71576074 3.00399864
H  1.55121335 8.57419532 3.10030075
C  0.04539765 7.33508118 4.03492816
H  0.01373478 7.89245956 4.96333153
C  -0.76236367 6.22005535 3.85390245
H  -1.4344986 5.88662849 4.63451833
C  -0.70166516 5.52360953 2.65005663
C  -1.45657268 4.31919687 2.3583306
C  -2.3675661 3.52297285 3.07145916
H  -2.75363427 3.68234473 4.06446146
C  -2.62971824 2.43487632 2.24981185
C  -3.41440437 1.21474606 2.46135682
C  -4.59058105 1.21461527 3.22136707
H  -4.9611315 2.13493297 3.65759911
C  -5.30070333 0.03034141 3.39622597
H  -6.21176927 0.03501833 3.98248978
C  -4.85598114 -1.15986664 2.82789984
H  -5.41327565 -2.07538592 2.98866902
C  -3.67695446 -1.17222782 2.07239415
C  -2.96897879 0.01828863 1.89582488
H  -2.05655098 0.01366585 1.3087373
C  -3.16835015 -2.39902868 1.45149443
C  -3.81559211 -3.48491472 0.87728663
H  -4.88046236 -3.63658796 0.81772832
C  -2.79502654 -4.29123307 0.34741959
C  -2.75646069 -5.49947467 -0.45523271
C  -3.88224729 -6.18949406 -0.89626841
H  -4.86881726 -5.84745665 -0.60993222
C  -3.72025048 -7.30933069 -1.70139281
H  -4.58230392 -7.86185179 -2.05521819
C  -2.43111893 -7.70118652 -2.0486404
H  -2.25460467 -8.56380187 -2.67838289
C  -1.35202353 -6.9720432 -1.56882799
H  -0.33954718 -7.26026513 -1.81267688
Cl -0.01531956 0.00066174 -0.0049221
