program: TURBOMOLE
programVersion: 7.3
elementType: fe
basis: def2-TZVP
elementType: n
elementType: c
elementType: h
method: uhf
method: dft
functional: b3-lyp
elementType: fe n c h
basis: def2-TZVP def2-TZVP def2-TZVP def2-TZVP
correction: disp3
energy: -4670.563608869 hartree
formula: C44H48Fe2N8
InChI: InChI=1/2C22H24N4.2Fe/c2*1-25(2)21-15-9-7-13-19(21)23-17-11-5-6-12-18(17)24-20-14-8-10-16-22(20)26(3)4;;/h2*5-16H,1-4H3;;/q2*-2;2*+2/rC44H48Fe2N8/c1-47(2)33-21-9-11-23-35(33)49-37-25-13-15-27-39(37)52-42-30-18-20-32-44(42)54(7,8)46(52)45(49)51(41-29-17-19-31-43(41)53(45,5)6)40-28-16-14-26-38(40)50(46)36-24-12-10-22-34(36)48(3)4/h9-32H,1-8H3
102 atoms
Fe 1.25151066 -0.20925732 0.42090511
Fe -1.10168331 0.17915423 -0.35204229
N  0.30535704 -0.48069101 -1.71849875
N  2.32026974 1.31829718 2.01472968
N  2.36748332 0.99022581 -0.67550685
N  -2.09291782 1.08818807 1.08104245
N  -0.30202483 -0.97383432 1.55080367
N  2.00907096 -2.24559302 0.72783459
N  -2.33101313 -1.30122619 -1.41712667
N  -1.85799251 2.40793665 -1.28185442
C  3.57342555 1.53807209 1.32364016
C  -3.20844718 1.79430019 0.65776822
C  -0.07604641 -1.71954263 -2.25394113
C  -3.12584581 2.46367483 -0.59569339
C  -4.45381479 1.79181689 1.30749586
C  3.55785705 1.39244515 -0.08998839
C  -1.36377401 -2.22967762 -1.98518124
C  0.78236565 -2.50857461 -3.03475103
C  2.02068996 1.23673221 -1.99496024
C  4.74865338 1.86395476 1.9871323
C  -1.80877623 0.77615759 2.39828023
C  1.00257846 0.42015423 -2.56032292
C  0.42439929 -3.78887361 -3.42643447
C  -0.93173908 -0.31667268 2.64326074
C  -2.25920605 1.5186697 3.5049465
C  4.77716017 1.56274888 -0.76793752
C  1.42989889 2.49299182 1.88166244
C  5.94044232 2.04522029 1.28930527
C  1.25599556 1.56920818 -4.69059668
C  -0.28094473 -2.37446046 1.55050536
C  -1.15528849 0.03059379 5.04258739
C  -1.34297452 -3.15924776 2.02537218
C  0.67055589 0.58136777 -3.90644788
C  2.44485709 0.98020391 3.43629472
C  -1.94344098 1.15219224 4.80510678
C  2.54106575 2.2779669 -2.78215703
C  -0.80973672 -4.3180462 -3.06068592
C  -0.8654242 3.31199049 -0.66651716
C  5.94474251 1.88645985 -0.09005469
C  -1.34383122 -4.53752692 1.87000944
C  -3.32219893 -1.89129186 -0.50384402
C  0.83267793 -3.0524175 1.00559828
C  2.1710074 2.44077684 -4.1109176
C  -3.02158125 -0.58442717 -2.51310533
C  -1.70768347 -3.52255771 -2.35867289
C  -0.64950609 -0.68019763 3.96072702
C  -1.90584449 2.68176874 -2.72056195
C  0.81724423 -4.42914646 0.83685435
C  -0.27916543 -5.18009926 1.24748969
C  2.86558243 -2.70600954 -0.37415787
C  2.81941744 -2.11146507 1.9615649
C  -4.24271997 3.09308308 -1.12986808
C  -5.56140885 2.42497624 0.75776708
C  -5.46545549 3.08094298 -0.46161954
H  -4.55583835 1.2523868 2.23854029
H  1.74457317 -2.09944267 -3.31414662
H  4.74538259 1.98487492 3.06154417
H  1.11971042 -4.38242408 -4.00769094
H  -2.86874761 2.39484075 3.33174256
H  4.80799766 1.40800204 -1.8367626
H  1.35595772 2.76449951 0.83510565
H  1.82493794 3.34589898 2.44683621
H  0.44046838 2.23967231 2.26155729
H  6.84654316 2.30321439 1.82174196
H  0.97668967 1.67197624 -5.73150456
H  -0.91727408 -0.27507749 6.05332909
H  -2.17994699 -2.66305935 2.49851749
H  -0.07716711 -0.07257808 -4.33780941
H  1.46968158 0.67034443 3.80524968
H  2.77785586 1.83750047 4.03499179
H  3.15632301 0.16972283 3.57194037
H  -2.31850433 1.74345551 5.63165656
H  3.25198297 2.96378733 -2.34303
H  -1.08202402 -5.3269756 -3.34090111
H  -0.83954461 3.14101566 0.40361372
H  0.11604271 3.10256738 -1.09223459
H  6.86594125 2.00463931 -0.64792717
H  -2.19188938 -5.11108849 2.2241058
H  -2.81299104 -2.51620781 0.22151679
H  -4.06844984 -2.48957992 -1.03855101
H  -3.83303833 -1.08109507 0.01626737
H  2.60567173 3.24560292 -4.69114727
H  -3.6655788 0.18356412 -2.0861933
H  -3.62322441 -1.2762724 -3.11342119
H  -2.27841405 -0.11537286 -3.15210338
H  -2.68935368 -3.90890476 -2.11905399
H  -0.00850094 -1.5369686 4.13087645
H  -0.93490667 2.44719223 -3.15086228
H  -2.6627437 2.06911948 -3.20264186
H  1.6692276 -4.92595296 0.39231942
H  -0.28849813 -6.25202554 1.10180904
H  2.25114637 -2.93394055 -1.23668424
H  3.4470947 -3.59299299 -0.09854458
H  3.55660776 -1.90201985 -0.62940067
H  3.62859552 -1.40280115 1.78284578
H  3.23924008 -3.07899969 2.25791729
H  2.18819319 -1.73881392 2.76379769
H  -1.1227511 4.36177848 -0.85737539
H  -2.1286427 3.73589992 -2.93320517
H  -4.1695072 3.60258328 -2.0806705
H  -6.50788368 2.39020065 1.28379267
H  -6.32426695 3.57681889 -0.89499177
empdispcorrection: -0.196689012 hartree
orbitalenergy: -5.8211 -5.1801 -4.9014 -4.4460 -4.3728 -1.4396 -1.0959 -0.4962 -0.3699 -0.2324 electronvolt
orbitalenergy: -5.4194 -5.1528 -4.8765 -4.5391 -4.5112 -1.4550 -1.1923 -1.0021 -0.7878 -0.6073 electronvolt
s2: 7.15027393
charge: -0.000000
dipole: 7.056039 -6.975811 0.080228 -17.842015 16.944813 -0.897202 0.916277 -1.217739 -0.301462
quadrupole: 10277.432473 -10523.575439 -246.142966 7596.300322 -7841.612257 -245.311935 7497.399726 -7747.834324 -250.434598 -82.789957 81.893135 -0.896822 33.147224 -23.115879 10.031345 5.517321 -3.715768 1.801553
