program: TURBOMOLE
programVersion: 7.3
title: Local memory allocated for RDGRAD: 12 MiB
elementType: fe
basis: def2-TZVP
elementType: n
elementType: c
elementType: h
method: uhf
method: dft
functional: b3-lyp
elementType: fe n c h
basis: def2-TZVP def2-TZVP def2-TZVP def2-TZVP
correction: disp3
energy: -4670.602524399 hartree
formula: C44H48Fe2N8
InChI: InChI=1/2C22H24N4.2Fe/c2*1-25(2)21-15-9-7-13-19(21)23-17-11-5-6-12-18(17)24-20-14-8-10-16-22(20)26(3)4;;/h2*5-16H,1-4H3;;/q2*-2;2*+2/rC44H48Fe2N8/c1-47(2)33-21-9-11-23-35(33)49-37-25-13-15-27-39(37)52-42-30-18-20-32-44(42)54(7,8)46(52)45(49)51(41-29-17-19-31-43(41)53(45,5)6)40-28-16-14-26-38(40)50(46)36-24-12-10-22-34(36)48(3)4/h9-32H,1-8H3
102 atoms
Fe 1.25141642 -0.2089404 0.42107017
Fe -1.10177757 0.17947117 -0.35187724
N  0.30526278 -0.4803741 -1.7183337
N  2.32017543 1.31861405 2.01489467
N  2.36738911 0.99054268 -0.67534188
N  -2.09301208 1.08850499 1.08120746
N  -0.30211913 -0.97351743 1.55096868
N  2.00897674 -2.24527614 0.72799962
N  -2.33110737 -1.30090933 -1.41696159
N  -1.85808672 2.4082535 -1.28168942
C  3.57333133 1.53838904 1.32380522
C  -3.20854145 1.79461708 0.65793327
C  -0.07614071 -1.71922572 -2.25377616
C  -3.12594007 2.46399177 -0.59552839
C  -4.45390905 1.79213381 1.30766088
C  3.55776279 1.39276203 -0.08982338
C  -1.36386824 -2.22936076 -1.98501618
C  0.78227138 -2.5082577 -3.03458597
C  2.0205957 1.23704916 -1.99479523
C  4.74855911 1.86427164 1.98729735
C  -1.80887047 0.77647448 2.39844521
C  1.00248424 0.42047114 -2.56015786
C  0.42430503 -3.78855676 -3.42626949
C  -0.9318333 -0.31635574 2.64342579
C  -2.25930032 1.51898661 3.50511151
C  4.77706593 1.56306576 -0.76777252
C  1.42980465 2.49330868 1.88182749
C  5.94034807 2.04553717 1.28947026
C  1.25590134 1.56952513 -4.69043169
C  -0.28103898 -2.37414355 1.55067038
C  -1.15538278 0.03091071 5.04275241
C  -1.34306872 -3.15893085 2.02553718
C  0.67046161 0.58168469 -3.90628291
C  2.44476279 0.98052084 3.43645979
C  -1.94353526 1.15250918 4.80527177
C  2.54097152 2.27828376 -2.78199199
C  -0.80983103 -4.3177293 -3.0605209
C  -0.86551847 3.31230742 -0.66635216
C  5.94464827 1.8867768 -0.08988961
C  -1.34392551 -4.53721005 1.8701745
C  -3.32229322 -1.89097499 -0.503679
C  0.83258366 -3.05210064 1.00576327
C  2.1709131 2.44109375 -4.1107526
C  -3.02167549 -0.58411024 -2.51294029
C  -1.70777775 -3.52224086 -2.35850791
C  -0.6496003 -0.67988071 3.960892
C  -1.90593879 2.68208563 -2.72039696
C  0.81714996 -4.42882957 0.8370194
C  -0.2792597 -5.17978232 1.24765473
C  2.86548814 -2.70569266 -0.37399288
C  2.8193232 -2.11114817 1.96172995
C  -4.24281425 3.09339997 -1.12970309
C  -5.56150306 2.42529313 0.75793207
C  -5.46554978 3.0812599 -0.46145456
H  -4.55593261 1.25270373 2.23870531
H  1.74447891 -2.09912578 -3.3139816
H  4.74528837 1.98519182 3.06170916
H  1.11961615 -4.38210716 -4.00752597
H  -2.86884186 2.39515764 3.33190756
H  4.80790336 1.40831893 -1.83659761
H  1.35586343 2.7648164 0.83527064
H  1.82484368 3.34621584 2.44700126
H  0.4403741 2.23998924 2.26172234
H  6.84644891 2.30353125 1.82190696
H  0.97659544 1.67229316 -5.73133955
H  -0.91736835 -0.27476063 6.05349409
H  -2.18004124 -2.66274249 2.4986825
H  -0.07726141 -0.0722612 -4.33764439
H  1.46958735 0.67066139 3.80541474
H  2.77776158 1.83781736 4.03515684
H  3.15622877 0.17003972 3.57210538
H  -2.31859858 1.74377239 5.63182155
H  3.25188867 2.96410423 -2.34286496
H  -1.08211831 -5.32665874 -3.3407361
H  -0.83963887 3.14133258 0.40377872
H  0.11594842 3.10288423 -1.09206952
H  6.86584698 2.00495622 -0.6477621
H  -2.19198361 -5.11077161 2.22427085
H  -2.81308525 -2.51589088 0.22168182
H  -4.06854407 -2.48926305 -1.03838604
H  -3.83313258 -1.0807782 0.01643239
H  2.60557746 3.24591984 -4.69098225
H  -3.66567301 0.18388101 -2.08602824
H  -3.62331864 -1.27595549 -3.11325615
H  -2.27850826 -0.11505593 -3.15193838
H  -2.68944796 -3.90858789 -2.11888897
H  -0.00859516 -1.53665171 4.13104142
H  -0.93500098 2.44750915 -3.15069725
H  -2.66283796 2.06943634 -3.20247686
H  1.66913338 -4.92563602 0.39248441
H  -0.28859238 -6.25170867 1.10197411
H  2.25105208 -2.93362363 -1.23651922
H  3.44700041 -3.59267604 -0.09837953
H  3.55651346 -1.90170295 -0.62923568
H  3.6285013 -1.40248421 1.7830108
H  3.23914578 -3.07868276 2.2580823
H  2.18809891 -1.73849706 2.76396274
H  -1.12284536 4.36209537 -0.85721036
H  -2.12873697 3.73621678 -2.93304014
H  -4.16960145 3.60290019 -2.08050548
H  -6.50797798 2.39051751 1.28395772
H  -6.32436119 3.57713576 -0.89482671
converged: yes
empdispcorrection: -0.196689013 hartree
orbitalenergy: -5.4263 -5.1109 -5.0245 -4.4207 -4.2855 -0.4722 -0.4359 -0.2460 -0.2064 -0.1660 electronvolt
orbitalenergy: -5.3414 -5.2026 -4.8697 -4.6450 -4.5638 -1.5320 -1.5286 -1.1074 -0.9178 -0.7841 electronvolt
s2: 20.03152048
charge: -0.000000
dipole: 6.981227 -6.909359 0.071869 -17.590493 16.632287 -0.958206 1.047253 -1.148872 -0.101620
quadrupole: 10277.429985 -10524.827393 -247.397408 7596.279133 -7841.902218 -245.623086 7497.400358 -7748.764167 -251.363809 -82.782592 81.591184 -1.191408 33.149257 -23.234262 9.914995 5.512376 -4.513568 0.998808
