program: Gaussian 09
title: 000051611
version: EM64L-G09RevD.01
frameworkgroup: C1[X(C17H19NO4)]
method: RPBEPBE
basis: SDD
operation: Freq
keyword: #p
keyword: freq=noraman
keyword: PBEPBE/SDD
title: #p freq=noraman PBEPBE/SDD
converged: YES YES NO NO
title: Mulliken charges:
elementType: O O O O N C C C C C C C C C C C C C C C C C H H H H H H H H H H H H H H H H H H H
charge: -0.452178 -0.435778 -0.293026 -0.283098 -0.304569 -0.423360 0.267992 -0.211822 0.273094 -0.485548 0.523235 -0.360685 -0.497243 -0.579678 -0.395109 0.293752 -0.417927 0.214975 -0.355936 0.210899 -0.521708 -0.535862 0.250265 0.227356 0.230934 0.206081 0.270409 0.242787 0.290326 0.258008 0.257367 0.218303 0.340356 0.239139 0.350957 0.228741 0.207686 0.259263 0.242806 0.221185 0.227611
chargesum: 0.00000
title: Mulliken charges with hydrogens summed into heavy atoms:
elementType: O O O O N C C C C C C C C C C C C C C C C C
charge: -0.111822 -0.084821 -0.293026 -0.283098 -0.034160 -0.173095 0.267992 0.015534 0.273094 -0.048533 0.523235 -0.117898 -0.206917 -0.321670 -0.137742 0.293752 -0.199624 0.214975 -0.116797 0.210899 0.173982 0.155740
polarizability: 2.77865413e+02 -7.78565792e+00 1.87699278e+02 1.40293071e+01 -1.43627098e+00 1.64537376e+02
1716.lowfreq: -14.2206 -1.4977 -0.0008 -0.0007 0.0002 4.7768 25.0980 33.1459 36.3634
frequency: 23.8328 33.0944 36.3486 69.0792 71.6767 104.1996 124.5326 138.0220 149.9828 159.4111 184.3693 196.8151 216.7451 236.7794 246.7407 274.9696 290.5748 294.3297 325.7419 341.5103 350.0984 353.8208 363.2457 396.0945 436.0578 447.5556 457.3683 469.0536 480.7829 499.3884 514.1308 552.1665 594.0314 604.1191 633.8200 651.6695 683.5707 703.8433 711.4673 724.7095 741.2775 772.7623 800.5601 810.6993 840.6880 885.1098 891.3366 895.9895 907.7076 935.8637 940.1151 955.7242 983.5332 989.0517 991.6457 1023.1065 1076.2854 1101.7850 1109.6102 1111.7965 1112.6506 1128.7023 1142.9670 1148.1338 1155.6397 1156.4666 1167.5266 1192.8391 1203.7692 1206.1932 1206.3751 1239.1122 1248.2827 1259.1385 1260.4669 1276.4435 1283.6484 1297.5263 1351.2469 1375.2822 1381.0977 1393.2751 1401.6667 1430.7920 1440.8029 1447.1877 1455.1952 1456.0148 1465.7784 1473.4086 1482.4123 1484.6554 1492.6534 1493.3979 1576.9620 1589.4938 1608.6329 1633.4509 2913.8696 2949.7295 2961.4030 2971.4202 2974.1975 3028.4221 3050.5268 3080.7852 3111.4148 3123.0726 3125.7650 3128.5522 3137.6091 3139.8975 3163.2945 3180.9899 3460.7141 3562.4844 3580.2980
redmass: 4.9282 4.5632 5.5721 2.4112 3.3901 4.2424 3.4241 1.8615 2.7521 4.6837 4.0196 2.9863 4.5493 2.8759 1.4061 1.1632 3.4938 3.4503 4.6101 4.4326 1.1193 5.0877 4.6925 3.1306 4.9197 3.4860 4.0669 4.4109 3.5620 5.6778 3.3323 2.9557 4.9606 5.1098 4.0417 4.6106 2.3090 4.7010 5.3554 4.1547 3.4651 3.2526 1.7640 1.4666 3.2536 3.6892 1.9151 1.7235 2.5692 1.3933 1.4033 2.6116 7.2123 4.5599 4.8279 1.9823 3.4423 2.2204 1.8083 1.2582 1.2432 3.6061 1.5463 1.3412 1.3281 1.3720 1.5494 1.2653 1.9339 1.7543 1.2431 1.4752 4.3401 1.6974 1.7755 1.4697 1.5759 1.2178 1.5941 2.2792 2.8656 6.1578 2.2511 1.2245 1.2872 1.7628 1.5148 1.3509 1.0513 1.1321 1.0566 1.1125 2.3838 2.8129 7.2598 7.6614 6.6736 6.6910 1.0679 1.0822 1.0326 1.0356 1.0844 1.0936 1.1040 1.0960 1.0875 1.0998 1.1045 1.0910 1.0963 1.0878 1.0947 1.0920 1.0752 1.0662 1.0660
irintensity: 0.4932 1.0666 0.4129 6.6184 1.7384 5.4575 1.8807 1.4851 1.1184 8.0926 5.2557 6.4909 0.1550 4.1324 3.2581 111.5138 21.0651 1.6345 17.7978 8.3796 140.4944 6.4211 3.2737 9.3638 0.9082 21.2394 10.6183 2.1207 2.5639 21.9874 35.9892 23.2592 19.8030 37.4296 10.2550 10.3642 83.8541 3.6174 24.9502 3.0753 10.0170 32.1215 20.9858 33.8179 9.9928 30.3872 30.9419 31.9049 30.8146 1.5889 2.8849 25.1072 52.4435 69.6195 46.8370 2.9716 16.1075 136.6212 51.6399 0.3782 7.6463 11.2590 6.9347 70.6761 93.5314 16.6520 3.2338 5.9601 52.6303 27.3250 9.2133 3.6783 262.0046 10.5579 33.1463 47.7010 9.1904 1.9363 11.3642 8.4260 46.1074 4.2150 17.5115 1.4578 12.3906 18.7761 32.1459 4.3642 14.6202 89.9906 28.9752 3.5032 165.4891 29.9668 12.1677 30.4801 14.7897 51.6390 43.8585 47.5338 66.8321 94.4024 22.2921 58.7759 43.3911 40.1735 18.8580 25.1612 18.8430 5.7254 14.5939 6.5842 9.5685 2.1202 3.1254 4.7271 36.9734
temp: 298.150 k
press: 1.00000 atm
elementType: 8 8 8 8 7 6 6 6 6 6 6 6 6 6 6 6 6 6 6 6 6 6 1 1 1 1 1 1 1 1 1 1 1 1 1 1 1 1 1 1 1
symmnumber: 1
zpe: 859362.1 jmol-1
zpe.correction: 0.327314 hartree
zpe.thermalcorrener: 0.348223 hartree
zpe.thermalcorrenthalpy: 0.349167 hartree
zpe.thermalcorrgfe: 0.277169 hartree
zpe.sumelectzpe: -1013.182591 hartree
zpe.sumelectthermal: -1013.161682 hartree
zpe.sumelectthermalent: -1013.160738 hartree
zpe.sumelectthermalfe: -1013.232736 hartree
dipole: -2.6623 0.2329 1.7404
dipole: 3.1892
quadrupole: -128.0965 -107.4100 -126.3312
quadrupole: -0.6386 -14.2867 3.7235
quadrupole: -7.4840 13.2025 -5.7186 -0.6386 -14.2867 3.7235
hfenergy: -1013.5099047 hartree
pointgroup: C01 [X(C17H19N1O4)]
dipole: -1.0537907 0.0542914 0.6789276 debye
polarizability: 277.6874041|-8.0293531|187.7082858|14.6576927|-0.3419132|164.7063769 unknown
InChI: InChI=1S/C17H19NO4/c1-21-15-6-3-10(7-16(15)22-2)17-12-5-4-11(19)8-13(12)14(20)9-18-17/h3-8,14,17-20H,9H2,1-2H3
charge 0 multiplicity 1
41 atoms
O  3.419277 1.719393 2.189159
O  5.156485 -2.332872 -0.098503
O  -4.299406 0.427093 -1.531587
O  -4.486915 -1.093949 0.876772
N  0.79509 2.421969 -0.404127
C  0.571544 1.063751 -0.983539
C  1.800648 0.183857 -0.749453
C  2.807386 1.898868 0.857917
C  2.847978 0.557856 0.137668
C  1.360005 2.421969 0.958555
C  -0.734229 0.422138 -0.4704
C  1.897335 -1.05356 -1.428461
C  3.951939 -0.300912 0.338125
C  -1.94432 0.673809 -1.164341
C  -0.79342 -0.343527 0.718761
C  4.026701 -1.528888 -0.348233
C  2.998219 -1.913059 -1.243583
C  -3.186125 0.189146 -0.705165
C  -2.026996 -0.837492 1.197379
C  -3.229158 -0.589976 0.49382
C  -5.518775 0.980814 -0.907808
C  -4.532007 -1.973165 2.047627
H  0.455042 1.2116 -2.07619
H  3.393574 2.636872 0.26741
H  0.801599 1.794976 1.691821
H  1.360181 3.462109 1.335818
H  -0.048104 3.003254 -0.487236
H  1.089246 -1.354359 -2.105595
H  4.737249 -0.023945 1.045329
H  -1.949378 1.251095 -2.09714
H  0.127206 -0.584089 1.26059
H  3.05253 -2.866769 -1.784675
H  3.571059 2.612403 2.590022
H  -2.039813 -1.438636 2.111607
H  5.111238 -3.170637 -0.622813
H  -6.224533 1.115961 -1.74166
H  -5.300516 1.96058 -0.439084
H  -5.930129 0.287498 -0.156749
H  -5.585891 -2.275229 2.138208
H  -4.215739 -1.441314 2.966091
H  -3.897773 -2.868431 1.900065
