program: TURBOMOLE
programVersion: 7.3
title: Memory allocated for RIDFT: 872 MiB
elementType: dy
basis: def2-TZVP
elementType: n
basis: def-SV(P)
elementType: c
elementType: h
method: uhf
method: dft
functional: pbe0
elementType: n c h dy
basis: def-SV(P) def-SV(P) def-SV(P) def2-TZVP
correction: disp3
frequency: -0.00 0.0000 0.0000 0.0000 0.0000 0.0000 50.00 50.00 50.00 50.00 52.18 61.68 71.04 80.92 84.42 90.85 101.89 103.92 108.87 115.51 117.56 126.82 133.09 136.39 138.60 146.81 154.06 167.33 171.29 180.96 185.64 187.44 193.37 214.64 232.40 272.00 280.21 288.47 290.85 293.38 298.41 300.75 304.07 312.42 329.01 350.59 386.12 393.85 398.87 407.81 414.09 555.45 556.23 556.82 557.18 562.70 563.10 611.13 612.68 626.09 641.65 642.28 654.54 656.18 681.66 710.45 736.97 804.82 826.12 828.91 832.58 834.11 935.58 957.62 968.40 969.77 970.74 973.13 1024.91 1038.14 1039.09 1040.65 1042.28 1045.97 1046.46 1047.54 1052.58 1055.59 1057.26 1059.10 1088.31 1089.97 1090.84 1091.70 1092.16 1097.55 1119.84 1121.82 1199.56 1204.12 1205.10 1207.31 1207.78 1244.92 1325.81 1388.00 1402.51 1402.84 1404.26 1405.02 1405.89 1407.16 1409.85 1413.42 1414.39 1417.28 1447.78 1449.75 1454.38 1456.27 1459.92 1462.16 1462.56 1464.06 1465.59 1466.59 1467.47 1469.09 1471.00 1471.99 1473.25 1473.97 1476.13 1478.22 1479.09 1480.79 1485.25 1494.46 1497.90 1512.37 1514.68 1516.81 1519.03 1521.62 1549.10 1550.52 1566.34 1570.32 1678.38 3014.53 3015.15 3016.36 3017.03 3020.79 3022.20 3024.25 3026.29 3027.66 3028.79 3080.11 3082.32 3088.04 3092.08 3094.11 3094.37 3094.49 3110.99 3111.49 3112.88 3118.15 3131.74 3132.95 3145.07 3145.17 3145.63 3146.84 3149.00 3149.31 3154.67 3159.54 3161.42 3170.46 3195.36
irintensity: 0.00000 0 0 0 0 0 0.07915 0.13503 1.72119 1.22643 1.04606 0.78096 0.32217 0.40756 0.42499 0.21647 0.12623 0.35241 0.20657 0.29726 0.42259 0.51125 0.12726 0.26679 0.33907 0.74357 0.23550 0.61956 0.20332 0.15112 1.15780 0.07966 2.11142 16.04263 0.92741 0.94471 0.92104 0.34181 1.57703 0.47976 0.50103 0.27998 0.83646 10.24360 98.88702 24.66599 4.65782 0.75985 3.32351 2.02503 0.13349 0.00303 0.12122 0.01828 0.03309 0.05659 0.06764 1.92320 0.53044 0.15350 0.27168 0.85901 0.17546 0.35862 1.37158 1.71834 44.50677 11.38634 0.26375 1.70241 3.12704 1.01116 0.37282 0.77860 0.31952 2.39260 0.85570 1.54212 27.21262 15.91250 28.06746 115.88494 8.21879 10.30266 7.87276 15.18138 0.95531 1.01838 0.51318 0.84396 0.93635 1.71878 7.23236 0.91435 2.18269 0.89277 0.31250 0.16955 12.96887 0.20862 0.08349 0.73305 0.15078 20.82246 43.08003 1.21065 0.10812 0.45718 0.36317 0.26482 0.02676 0.29113 8.49247 2.33317 0.31555 0.13637 1.10500 2.49422 11.42979 1.31358 6.74633 7.86839 11.17045 8.44189 11.81054 1.61455 12.01668 2.61475 1.71538 1.73262 2.26099 1.97151 7.54031 1.29719 70.57618 18.48378 3.93879 9.64109 16.42297 0.59472 0.19357 1.29687 0.06995 0.20619 0.60561 0.28635 6.17642 3.70477 49.77947 32.74048 14.30507 48.58391 35.79761 9.75585 42.00014 34.65427 32.68532 50.17420 23.28944 18.51448 16.73930 10.39354 10.42178 5.14198 13.96773 13.56671 4.53022 9.68429 7.58338 11.77987 5.12880 18.14516 7.63189 6.10517 15.17147 5.73907 2.14729 4.75854 12.59369 4.67690 29.14332 40.56347 14.67079
energy: -1927.715492214 hartree
zeropoint: 0.5208269 hartree
formula: C24H34DyN2
InChI: InChI=1/2C10H15.C4H4N2.Dy/c2*1-6-7(2)9(4)10(5)8(6)3;1-2-6-4-3-5-1;/h2*1-5H3;1-4H;/q;;-1;+1/rC24H34DyN2/c1-15-16(2)18(4)19(5)17(15,3)25(15,16,18,19,27-13-11-26-12-14-27)20(6)21(25,7)23(25,9)24(25,10)22(20,25)8/h11-14H,1-10H3
61 atoms
Dy 2.9398211 2.02378932 -1.1077522
N  1.2496166 0.57240905 -0.66975359
N  -1.25989975 -0.79869874 -0.32247977
C  0.37561805 0.83264694 0.37161265
H  0.67868327 1.59331123 1.10230408
C  -0.8208725 0.17210802 0.51190602
H  -1.47315875 0.42800474 1.35713644
C  -0.38668301 -1.07846762 -1.32118914
H  -0.67952661 -1.8707358 -2.0223377
C  0.81479597 -0.44085151 -1.50529413
H  1.46306392 -0.70193173 -2.34837576
C  4.9486111 1.01964901 0.18224326
C  4.35572124 -0.10170036 -0.47035626
C  4.54925623 0.06243514 -1.8666647
C  5.28152379 1.26869335 -2.07989995
C  5.54048001 1.85531438 -0.80971652
C  5.00833749 1.23800372 1.66564942
H  5.10611478 2.3072997 1.92338387
H  5.8782522 0.72246492 2.11575664
H  4.1114553 0.84715295 2.17819275
C  3.71108176 -1.26680614 0.21482001
H  3.15552222 -0.95926786 1.11613479
H  4.4700232 -2.00841285 0.52837239
H  2.98664496 -1.77984539 -0.43692252
C  4.17595161 -0.89709259 -2.9576514
H  3.59678568 -0.41666542 -3.76896728
C  5.84244071 1.676724 -3.40805248
H  5.08521126 1.64800482 -4.21124805
H  6.65304608 0.98743258 -3.71326629
H  6.26791873 2.69102597 -3.38724932
C  6.37774568 3.06737205 -0.53184533
H  6.54965383 3.66196404 -1.44246239
H  7.37083887 2.78025892 -0.13782586
H  5.92034996 3.7377145 0.21776036
C  2.60073967 4.63206702 -1.25207649
C  3.04441491 4.25141842 -2.54769734
C  2.0367144 3.42450496 -3.12793022
C  0.94475938 3.34528021 -2.21299151
C  1.29743666 4.0818809 -1.05161692
C  3.29543372 5.57631996 -0.31683174
H  3.14116244 5.30408156 0.7429493
H  2.9144234 6.60931095 -0.43385746
H  4.3824054 5.61029735 -0.49757812
H  5.10594075 4.9379529 -2.57703692
C  2.04219174 2.84566615 -4.51287623
H  3.06220733 2.76591425 -4.92331164
H  1.45861319 3.47268797 -5.21365666
H  1.5913231 1.8375657 -4.54326317
C  -0.36426634 2.67152509 -2.48447271
H  -0.24605732 1.79157617 -3.13779799
H  -1.06418039 3.36431711 -2.98944245
H  -0.84876105 2.31547364 -1.56102467
C  0.41941019 4.35159683 0.13425515
H  -0.43837526 3.66215586 0.16826162
H  0.01759221 5.38231439 0.10004495
H  0.95888467 4.25841688 1.09516939
H  3.57738087 -1.73841516 -2.57567498
H  5.07935114 -1.32567328 -3.43133032
C  4.24726055 4.79584745 -3.25299711
H  4.01636376 5.78502309 -3.69297743
H  4.57425214 4.1461214 -4.07867753
converged: yes
nucrepener: 3624.569964179 hartree
empdispcorrection: -0.055984161 hartree
orbitalenergy: -6.5193 -6.2442 -6.1611 -5.9656 -3.1878 -1.4343 -0.8414 0.2299 0.3086 0.6113 electronvolt
orbitalenergy: -6.4842 -6.2855 -6.1837 -6.1134 -5.9783 -1.4252 -0.7933 -0.4446 -0.4096 -0.2942 electronvolt
s2: 12.57784090
charge: -0.000000
dipole: 1194.483591 -1192.474387 2.009204 815.363620 -813.915997 1.447624 -554.251370 554.033705 -0.217665
quadrupole: 9830.246249 -9964.600653 -134.354404 5952.858891 -6088.239910 -135.381019 3121.367620 -3254.264258 -132.896638 4557.362261 -4551.260666 6.101595 -3077.805425 3074.521516 -3.283910 -2394.529754 2396.529737 1.999983
