program: Gaussian 09
title: 000051615
version: EM64L-G09RevD.01
frameworkgroup: C1[X(C18H21NO5)]
method: RPBEPBE
basis: SDD
operation: Freq
keyword: #p
keyword: freq=noraman
keyword: PBEPBE/SDD
title: #p freq=noraman PBEPBE/SDD
converged: YES YES NO NO
title: Mulliken charges:
elementType: O O O O O N C C C C C C C C C C C C C C C C C C H H H H H H H H H H H H H H H H H H H H H
charge: -0.453364 -0.435280 -0.295733 -0.279998 -0.298788 -0.304374 -0.434652 0.267338 -0.214671 0.273920 -0.483001 0.581637 -0.361564 -0.498602 -0.526498 -0.641327 0.291990 -0.419214 0.256576 0.258983 0.025463 -0.525115 -0.536112 -0.518535 0.252964 0.229122 0.227864 0.208613 0.272671 0.244176 0.290434 0.270913 0.260138 0.219242 0.341484 0.351565 0.267199 0.225407 0.209354 0.241921 0.230452 0.227069 0.226013 0.256380 0.217943
chargesum: 0.00000
title: Mulliken charges with hydrogens summed into heavy atoms:
elementType: O O O O O N C C C C C C C C C C C C C C C C C C
charge: -0.111880 -0.083715 -0.295733 -0.279998 -0.298788 -0.031703 -0.181688 0.267338 0.014450 0.273920 -0.046525 0.581637 -0.117388 -0.208168 -0.255586 -0.381189 0.291990 -0.199972 0.256576 0.258983 0.025463 0.176845 0.163330 0.181801
polarizability: 2.83182167e+02 -1.82986511e+01 2.08754233e+02 -1.55881355e+01 -1.82848334e+00 1.83714878e+02
1716.lowfreq: -5.2763 -2.4419 -0.0010 -0.0007 -0.0004 6.2618 20.2065 29.7688 34.8135
frequency: 19.9036 29.7378 34.8112 63.7370 76.2944 89.0791 95.7988 112.0387 118.2454 147.0403 155.1363 163.1741 172.2098 181.0673 201.8921 219.3342 227.2233 243.0554 274.2853 284.9302 286.7629 304.6175 312.4356 325.4557 352.1140 353.3620 381.6364 394.6251 399.4768 425.9831 449.8979 463.8120 493.0666 501.8182 512.2719 535.9773 555.9292 596.8492 627.1157 630.9317 634.5595 669.7690 690.8498 706.8914 734.6003 759.9334 768.3051 802.8066 842.2653 856.7974 869.5442 876.5826 893.4987 906.7152 922.2874 938.7315 952.0856 956.3988 988.0036 1002.6775 1024.6309 1063.7547 1076.1681 1106.3703 1110.3178 1111.2810 1112.1844 1116.9094 1131.8805 1149.1645 1154.0798 1154.4183 1158.5727 1160.1961 1191.2690 1196.9503 1207.5167 1208.7811 1225.8472 1241.5351 1261.8499 1276.4622 1278.4492 1292.7162 1300.3551 1351.7126 1371.0859 1380.1022 1393.9737 1403.9618 1420.7158 1436.0087 1443.0042 1448.2090 1453.9835 1456.1769 1457.4522 1465.2212 1468.4806 1480.5480 1482.7784 1484.2340 1488.3970 1494.7926 1577.9459 1590.0466 1595.8248 1633.6384 2910.4530 2952.6477 2965.8142 2970.8687 2977.0642 2979.2661 3029.8351 3055.8916 3079.2950 3081.8433 3112.9866 3122.0476 3125.5790 3126.0522 3138.6882 3139.4078 3161.4390 3180.7823 3460.1287 3563.4585 3580.1751
redmass: 4.9064 5.3638 5.7396 3.5029 3.3978 2.5559 3.0945 3.5577 4.1321 1.5659 2.7497 1.6274 2.8503 2.6867 1.9820 2.5859 4.6857 3.9007 1.9470 3.3991 1.2781 3.5277 4.4135 4.8286 1.1867 3.7691 4.4862 3.6256 4.9650 5.2591 3.6360 3.9616 5.4344 5.3587 4.4518 4.6082 2.8357 4.7332 5.0202 4.1754 4.0974 5.0561 2.2114 4.6754 3.9367 3.4966 4.1886 1.6019 3.5817 1.5840 3.3606 1.9963 1.7428 2.8594 4.8670 1.5062 8.4075 2.9195 4.5467 5.6691 1.9894 6.6159 3.4209 1.7455 1.2569 1.2450 1.2408 2.2382 3.8650 1.3472 1.3764 1.4091 1.3317 1.4379 1.9889 1.3398 1.7511 1.2578 1.5538 1.4524 2.1388 1.4905 1.5803 3.2424 1.4106 1.6198 4.9553 1.7937 5.9023 1.7745 1.2798 1.2767 1.3702 1.8210 1.2531 1.6936 1.0974 1.0764 1.4638 1.4821 1.0582 1.1211 1.0619 2.9276 7.4867 7.6563 6.7217 6.6893 1.0683 1.0825 1.0325 1.0349 1.0320 1.0842 1.0930 1.1042 1.0970 1.1013 1.0874 1.1038 1.1047 1.1003 1.0962 1.0915 1.0902 1.0919 1.0752 1.0662 1.0659
irintensity: 0.5261 0.7801 0.1132 0.3942 6.7709 6.8246 3.7140 1.4240 2.4256 2.4539 7.7001 3.4422 1.6787 2.7842 1.1187 6.6545 5.2320 4.8168 0.0899 7.6833 127.7626 1.2310 11.2003 8.3699 126.4638 20.1040 9.6288 8.4614 0.8281 4.7981 19.9230 6.4941 3.7643 13.9431 32.4657 12.9407 28.7968 4.4280 8.3521 32.3744 10.2360 59.4708 89.4749 5.0404 2.7397 19.0686 15.8904 22.7583 7.9716 14.8786 17.2384 34.2961 29.6794 33.1183 11.5186 0.1239 42.8213 28.7966 59.4162 21.6694 3.3926 268.2884 11.5855 60.3993 1.5591 12.3095 4.5732 72.4620 25.5840 60.6520 5.3400 8.7403 103.8999 21.6127 45.3947 13.1520 6.3055 21.3780 34.7687 4.8653 33.6907 39.8977 20.1022 123.6927 34.7948 15.3427 0.3511 37.2097 3.2131 70.9264 10.6612 13.3412 14.6823 28.2745 39.5984 15.0347 5.5184 22.3220 71.7784 42.0100 11.3005 5.9036 26.8018 74.3663 83.5214 37.9518 37.0339 50.6192 47.1098 45.1719 51.9941 99.7467 74.2168 22.7439 58.3742 36.1374 34.5599 30.9223 17.7526 21.1803 19.0216 24.6135 13.2386 4.8955 1.9259 2.1115 2.6697 4.6550 37.4156
temp: 298.150 k
press: 1.00000 atm
elementType: 8 8 8 8 8 7 6 6 6 6 6 6 6 6 6 6 6 6 6 6 6 6 6 6 1 1 1 1 1 1 1 1 1 1 1 1 1 1 1 1 1 1 1 1 1
symmnumber: 1
zpe: 941401.9 jmol-1
zpe.correction: 0.358561 hartree
zpe.thermalcorrener: 0.382340 hartree
zpe.thermalcorrenthalpy: 0.383284 hartree
zpe.thermalcorrgfe: 0.304995 hartree
zpe.sumelectzpe: -1127.528536 hartree
zpe.sumelectthermal: -1127.504757 hartree
zpe.sumelectthermalent: -1127.503813 hartree
zpe.sumelectthermalfe: -1127.582102 hartree
dipole: 0.4171 0.6521 0.6182
dipole: 0.9906
quadrupole: -146.8984 -124.2929 -130.7109
quadrupole: 1.8356 2.5892 -12.3399
quadrupole: -12.9310 9.6745 3.2565 1.8356 2.5892 -12.3399
hfenergy: -1127.8870971 hartree
pointgroup: C01 [X(C18H21N1O5)]
dipole: -0.170973 -0.2386065 0.2563704 debye
polarizability: 282.2172923|-17.8772124|209.1911335|18.5962169|-0.3056047|184.2428517 unknown
InChI: InChI=1S/C18H21NO5/c1-22-15-6-10(7-16(23-2)18(15)24-3)17-12-5-4-11(20)8-13(12)14(21)9-19-17/h4-8,14,17,19-21H,9H2,1-3H3
charge 0 multiplicity 1
45 atoms
O  3.510247 0.908357 2.502879
O  5.146083 -2.213515 -1.004856
O  -4.11865 1.333302 -1.492417
O  -2.121232 -1.926742 1.542457
O  -4.400077 -0.861863 0.336436
N  1.043707 2.616277 0.243277
C  0.770491 1.543787 -0.758578
C  1.948204 0.571231 -0.821059
C  2.976483 1.57257 1.296516
C  2.975496 0.555331 0.162971
C  1.560285 2.133796 1.537956
C  -0.577562 0.837832 -0.499358
C  2.011589 -0.361528 -1.883072
C  4.026665 -0.385454 0.079134
C  -0.675184 -0.27119 0.378677
C  -1.752221 1.364993 -1.077761
C  4.068778 -1.305661 -0.986881
C  3.060518 -1.296582 -1.982378
C  -3.017178 0.794968 -0.800944
C  -1.93538 -0.837931 0.672025
C  -3.124317 -0.325241 0.068489
C  -5.282498 1.757315 -0.684208
C  -0.932831 -2.455692 2.220617
C  -4.60189 -2.274365 -0.055798
H  0.685911 2.053515 -1.73912
H  3.634983 2.421111 1.008742
H  0.939026 1.342636 2.018248
H  1.608911 2.991868 2.234543
H  0.234379 3.241402 0.3447
H  1.217853 -0.361678 -2.639305
H  4.796581 -0.414373 0.853742
H  0.238072 -0.700194 0.800085
H  -1.71539 2.215642 -1.767707
H  3.091335 -2.007516 -2.818329
H  3.710747 1.600736 3.182261
H  5.087608 -2.808974 -1.792826
H  -5.683439 0.913694 -0.099469
H  -6.022727 2.114783 -1.416413
H  -4.993446 2.58573 -0.008026
H  -1.309618 -3.256022 2.874232
H  -0.439943 -1.674038 2.829594
H  -0.205638 -2.872044 1.497326
H  -5.654025 -2.491699 0.184466
H  -3.931205 -2.934164 0.519549
H  -4.428099 -2.399206 -1.141518
