program: TURBOMOLE
programVersion: 7.3
elementType: c
basis: def2-TZVP
elementType: n
elementType: h
method: uhf
method: dft
functional: pbe0
elementType: c n h
basis: def2-TZVP def2-TZVP def2-TZVP
correction: disp3
energy: -264.1087499357 hartree
formula: C4H4N2
InChI: InChI=1/C4H4N2/c1-2-6-4-3-5-1/h1-4H
10 atoms
C  -1.12934456 0.69871083 0.0000
C  -1.12934456 -0.69871083 0.0000
N  0.0000 -1.40071325 0.0000
C  1.12934456 -0.69871083 0.0000
C  1.12934456 0.69871083 0.0000
N  0.0000 1.40071325 0.0000
H  -2.07134188 1.2610167 0.0000
H  -2.07134188 -1.2610167 0.0000
H  2.07134188 -1.2610167 0.0000
H  2.07134188 1.2610167 0.0000
nucrepener: 209.016333620 hartree
empdispcorrection: -0.002293432 hartree
energy: -264.1087499357024
energyOcCorr: -264.1088138779
s2: -0.00000000
charge: -0.000000
dipole: 0.000000 0.000000 0.000000 -0.000000 0.000000 -0.000000 0.000000 0.000000 0.000000
quadrupole: 170.596644 -189.807306 -19.210662 162.645500 -193.305328 -30.659827 0.000000 -26.747589 -26.747589 0.000000 -0.000000 -0.000000 0.000000 0.000000 0.000000 0.000000 0.000000 0.000000
