program: Gaussian 16
title: Busca de TS do rc_atv_CH_Ar_Cl_orto
version: EM64L-G16RevC.01
frameworkgroup: C1[X(C27H25ClN4O6Pd)]
method: RM06L
basis: def2SVP
operation: Freq
keyword: #P
keyword: Geom=AllCheck
keyword: Guess=TCheck
keyword: SCRF=Check
keyword: Test
keyword: GenChk
keyword: RM06L/def2SVP
keyword: Freq
converged: YES YES YES YES
title: Mulliken charges:
elementType: Pd O N C H H C C C H H H O O N C C C C C C C H H H C C C C H H C C O C H H C H H H H N H C N O H H C H O H C C C C H C H C H H Cl
charge: 0.482581 -0.489969 -0.521234 0.069651 0.094477 0.095019 0.339441 0.278057 -0.091352 0.102072 0.086559 0.102724 -0.429820 -0.407436 -0.014621 0.108012 -0.288845 0.359148 0.026272 -0.168581 -0.067947 -0.000298 0.076755 0.074442 0.080689 -0.031202 -0.022482 -0.001142 -0.031342 0.074921 0.083860 -0.320855 -0.019036 -0.409104 0.136998 0.069730 0.082562 0.119424 0.069543 0.073349 0.337984 0.074708 -0.315781 0.181778 0.352558 -0.208820 -0.434880 0.178817 0.076629 0.262964 0.061574 -0.347470 0.022016 0.151338 -0.118640 -0.095532 -0.021019 0.053147 -0.029142 0.051505 0.052512 0.060176 0.061808 -0.179252
chargesum: -0.00000
title: Mulliken charges with hydrogens summed into heavy atoms:
elementType: Pd O N C C C C O O N C C C C C C C C C C C C C O C C N C N O C O C C C C C C Cl
charge: 0.482581 -0.489969 -0.521234 0.259148 0.339441 0.278057 0.200004 -0.429820 -0.069452 -0.014621 0.108012 -0.288845 0.359148 0.099622 -0.091827 0.006496 0.080391 0.043506 0.052439 0.082718 -0.009325 -0.320855 -0.019036 -0.409104 0.289289 0.265596 -0.134002 0.352558 -0.030003 -0.434880 0.324539 -0.347470 0.151338 -0.065494 -0.044027 0.039157 0.032666 0.052512 -0.179252
polarizability: 6.64805276e+02 -9.17417286e+01 6.22151532e+02 -6.06763561e+01 3.25936420e+01 4.62267351e+02
1716.lowfreq: -1593.3201 0.0006 0.0017 0.0023 3.2840 6.9212 12.7029 13.2608 19.4564
frequency: -1593.3200 12.9777 19.4107 20.6529 27.9588 37.7382 39.3746 43.6568 54.7795 56.2553 74.4290 78.7559 80.1421 84.9857 89.8064 103.5380 104.8855 119.1767 125.6018 137.7235 141.6377 150.8998 162.0110 169.0638 176.7681 186.8425 190.3426 214.7668 224.4644 227.9995 232.6562 249.9249 265.4845 272.1322 279.4240 285.7673 290.9606 294.3285 311.6210 340.5781 341.4893 370.4300 380.3033 396.3005 414.4268 418.0464 426.1406 446.9169 450.9855 457.4083 466.1713 478.5898 492.5239 502.8955 516.0517 517.6202 548.7731 576.8054 590.2907 596.2191 609.3178 612.0992 616.2797 636.4537 641.4339 668.3966 688.8982 693.4404 716.5285 722.4506 737.4059 741.1158 757.1388 757.8331 766.0237 767.2406 769.1595 785.6863 822.1572 829.9542 839.2013 845.5230 863.5997 871.1336 902.7300 923.8362 949.1623 953.2993 954.1698 954.9973 971.0414 974.8878 982.2796 986.2571 1008.7996 1014.9774 1015.3988 1025.5004 1025.6905 1027.2446 1032.5529 1043.0780 1055.4333 1069.1095 1077.0937 1104.4556 1117.3434 1118.5469 1132.5472 1133.1779 1154.4614 1166.8998 1171.8031 1175.5105 1181.5427 1196.4951 1238.6987 1241.3941 1241.5642 1254.7997 1270.8748 1284.6455 1293.8233 1297.3203 1306.3037 1319.8858 1322.4732 1323.2974 1328.1669 1349.3481 1370.1138 1383.4805 1395.7404 1401.7619 1403.7791 1413.2880 1414.1263 1417.3831 1425.4525 1436.1865 1440.0269 1452.1696 1456.5890 1466.1074 1485.1195 1491.4915 1513.8239 1523.7338 1530.7626 1554.5692 1595.3207 1617.6215 1634.3809 1635.9454 1638.7558 1657.7952 1666.0650 1669.2099 1742.1518 1748.4785 1771.3847 2340.6491 2929.5338 3027.5454 3033.6129 3058.8432 3077.7464 3091.6099 3113.4235 3155.6740 3166.6628 3168.5833 3175.3999 3179.3006 3186.8934 3188.1428 3196.4113 3200.7900 3202.7857 3204.7966 3210.0490 3214.4583 3228.3037 3249.3973 3480.7564 3589.8420
redmass: 1.0997 8.0112 7.1200 8.4258 7.9435 3.7619 6.9647 5.3724 9.6798 9.5301 5.9293 5.7543 9.7913 8.0340 4.0168 5.7581 6.6547 5.1669 5.6170 3.2288 1.6652 6.0030 4.4171 7.7063 3.3427 6.2156 5.3905 6.8212 4.3111 6.1834 5.3445 3.6776 7.3194 5.4507 5.3784 7.0937 5.3513 3.8619 7.7309 6.4992 6.5333 3.1513 8.2288 4.3444 4.6200 5.0755 3.0671 2.7243 2.1392 4.1109 2.5815 4.6399 4.1748 5.7315 3.4463 2.5249 3.8649 2.6762 5.2342 4.3854 3.4810 4.7683 5.5343 7.0055 5.8984 5.2320 4.7585 5.8277 1.4451 3.3186 7.0276 3.0343 3.0250 3.1860 1.5403 1.5029 3.0463 5.4165 1.2792 4.1266 1.7479 4.6406 3.8023 1.6146 1.2903 3.2039 3.3074 1.3961 4.7540 2.4068 1.3575 1.3292 2.4143 1.4144 1.3208 3.3694 1.7352 1.5938 2.5791 2.0328 2.7177 1.7935 2.0503 3.5408 2.0448 2.0234 1.4997 1.5544 2.0549 1.6838 1.0748 1.1695 1.1070 2.9875 4.0789 1.2322 2.3198 2.8108 1.0916 1.3324 1.4545 1.8941 1.3091 1.3175 1.3838 1.6829 1.8042 2.0392 1.7016 1.2714 2.1808 1.8549 2.5576 1.6364 1.1205 1.7011 2.3886 2.3638 1.0451 1.6557 1.7095 4.3271 1.1474 2.0582 2.8817 2.5210 6.5160 2.5486 2.7890 1.9809 2.7039 5.9432 5.9127 7.1029 7.4676 3.2981 6.4861 6.5831 12.0204 9.6569 6.4741 12.6822 1.0854 1.0619 1.0598 1.0398 1.0644 1.1041 1.1084 1.1057 1.1027 1.0875 1.0908 1.0887 1.0939 1.0889 1.0999 1.0914 1.0926 1.0958 1.1062 1.0994 1.0944 1.0932 1.0804 1.0797
irintensity: 4744.6326 1.4356 1.9628 1.6719 1.2967 0.5147 1.6529 5.0742 5.8507 4.4129 4.7388 3.6560 4.8709 7.1947 17.1764 3.6847 1.3139 2.5863 4.8591 2.0848 0.8652 5.8607 2.3093 12.2981 2.2399 2.7219 6.6654 4.5718 0.8841 1.0277 9.4782 11.2968 23.2658 7.1001 11.0945 1.3601 12.4775 9.0878 7.5570 0.2209 0.3918 15.7880 108.8531 20.5094 7.3122 3.3644 0.5657 36.2844 41.3024 65.6904 19.3817 7.4189 27.9294 3.8413 10.9135 28.0813 7.0577 10.9812 7.6223 22.3669 7.9385 0.0912 21.8404 0.4719 4.2107 22.4153 2.0168 20.0475 192.6440 25.7108 31.8282 12.4839 3.2490 18.8730 102.0044 55.5531 1.9435 14.8300 7.7473 11.4969 60.6645 44.8424 17.6282 3.6985 1.4552 47.8382 16.6246 2.2107 10.5700 4.9906 2.9053 0.1837 7.8044 3.9811 0.5616 19.1376 2.9862 0.8788 14.3019 16.7890 35.3179 14.9923 1.4888 112.1986 12.9725 45.3146 47.5867 5.2020 12.9873 37.0917 2.9256 48.3826 13.2658 0.8532 81.4135 20.1046 162.0637 2.9795 1.0808 319.6569 255.3784 97.5860 25.8689 410.2968 97.2527 220.7989 493.7244 264.3540 67.6923 32.4593 342.3824 78.6449 56.6061 16.3046 42.3512 119.9285 33.5212 49.5231 16.4122 28.6199 49.6547 1.5284 49.9275 14.6738 73.2333 0.8040 32.8442 560.2638 161.8603 197.9360 914.7039 3.4516 120.3624 88.3030 649.1895 275.7372 201.9391 31.5042 1430.8671 969.4063 355.2899 292.6374 107.3042 52.9680 45.2869 14.3695 40.2188 7.5097 40.9121 8.5947 0.7003 3.9836 11.6902 6.2095 9.9513 5.7761 25.9947 2.7322 5.1473 3.9988 5.1555 10.5183 0.8994 3.6835 631.8592 315.7832
temp: 298.150 k
press: 1.00000 atm
elementType: 46 8 7 6 1 1 6 6 6 1 1 1 8 8 7 6 6 6 6 6 6 6 1 1 1 6 6 6 6 1 1 6 6 8 6 1 1 6 1 1 1 1 7 1 6 7 8 1 1 6 1 8 1 6 6 6 6 1 6 1 6 1 1 17
symmnumber: 1
zpe: 1261003.5 jmol-1
zpe.correction: 0.480291 hartree
zpe.thermalcorrener: 0.517434 hartree
zpe.thermalcorrenthalpy: 0.518378 hartree
zpe.thermalcorrgfe: 0.407022 hartree
zpe.sumelectzpe: -2300.507589 hartree
zpe.sumelectthermal: -2300.470447 hartree
zpe.sumelectthermalent: -2300.469503 hartree
zpe.sumelectthermalfe: -2300.580858 hartree
dipole: 0.2419 5.3905 8.1501
dipole: 9.7745
quadrupole: -350.1445 -186.8909 -246.3070
quadrupole: -21.1157 34.9327 10.8352
quadrupole: -89.0304 74.2233 14.8071 -21.1157 34.9327 10.8352
hfenergy: -2300.9878803 hartree
pointgroup: C01 [X(C27H25Cl1N4O6Pd1)]
dipole: 0.084322 2.1144959 3.210958 debye
polarizability: 665.6037502|-91.4816097|621.3266255|-60.8076117|32.6124004|462.2937833 unknown
InChI: InChI=1/27C.Cl.4N.6O.Pd.25H
charge 0 multiplicity 1
64 atoms
Pd 3.18489654 -0.63736488 0.01514983
O  4.75790115 -0.29745309 -1.29035795
N  3.92187708 -2.49657425 -0.06734538
C  5.07432774 -2.64946838 -0.93072549
H  5.95060273 -3.03051676 -0.37840937
H  4.88733971 -3.37867939 -1.73806745
C  5.47644609 -1.33952709 -1.57877002
C  3.42322172 -3.50745451 0.61562195
C  4.04340732 -4.86203657 0.50015225
H  5.09629388 -4.8329222 0.81302841
H  3.5037922 -5.58178778 1.12264788
H  4.03013842 -5.20566359 -0.54344539
O  6.43979133 -1.29383671 -2.33582378
O  2.41524656 -3.37092412 1.38248288
N  2.54936232 1.31452687 0.05615493
C  2.02876878 2.32065563 0.32384053
C  1.41159088 3.5349675 0.69789205
C  0.22072532 3.94260599 0.04300004
C  1.96017253 4.31356046 1.7335956
C  -0.39185022 5.13570264 0.44282769
C  1.33854918 5.49201441 2.11841057
C  0.16797578 5.89257774 1.4687802
H  -1.30705001 5.47491937 -0.04199118
H  1.76250548 6.09750867 2.92078559
H  -0.32703539 6.81966101 1.76741777
C  0.59821351 0.55964297 3.06426339
C  -0.58560133 0.691603 2.32724639
C  1.64061889 -0.22859933 2.58233188
C  -0.74280177 0.00717218 1.12605831
H  -1.3907534 1.32924192 2.70049206
H  2.56780619 -0.30934929 3.157393
C  1.52260203 -0.90603572 1.3552083
C  0.29959652 -0.79646514 0.64348523
O  -0.23326248 3.1366105 -0.92466578
C  -1.37346528 3.55760899 -1.68330378
H  -2.24487957 3.66002715 -1.01556029
H  -1.16957586 4.54043927 -2.13836402
C  -1.63493731 2.52981221 -2.75306877
H  -2.43013988 2.91849139 -3.40401538
H  2.87473232 3.97237236 2.22202497
H  2.05665737 -2.11216933 1.32414673
H  0.70725352 1.08954629 4.01413323
N  -2.02390324 1.23793383 -2.25015643
H  -1.29757903 0.56979712 -2.00520682
C  -3.31029062 0.99070624 -1.86756624
N  -3.47588043 -0.271829 -1.33638759
O  -4.21244564 1.81509636 -2.00062995
H  -2.62644048 -0.83681532 -1.27433285
H  -0.73913669 2.40828244 -3.37745153
C  0.16404335 -1.5458474 -0.60876797
H  1.01062169 -2.24368967 -0.82529302
O  -0.77566006 -1.46970742 -1.38768583
H  -1.67158262 0.09245801 0.55585325
C  -4.61170722 -0.82992448 -0.75940169
C  -5.89309032 -0.25488886 -0.81301108
C  -4.45331604 -2.05662798 -0.08769522
C  -6.97347772 -0.8892203 -0.20481882
H  -6.04504126 0.6885422 -1.33220112
C  -5.53071571 -2.69269977 0.51533834
H  -3.46129003 -2.51519319 -0.03981353
C  -6.79228367 -2.10103006 0.45680759
H  -7.96467467 -0.43473001 -0.25289881
H  -5.38789762 -3.64342144 1.03207424
Cl -8.15673253 -2.88758468 1.21822342
