program: Gaussian 16
title: titulo
version: EM64L-G16RevC.01
frameworkgroup: C1[X(C22H24N4O6Pd)]
method: RM06L
basis: def2SVP
operation: Freq
keyword: #P
keyword: Geom=AllCheck
keyword: Guess=TCheck
keyword: SCRF=Check
keyword: Test
keyword: GenChk
keyword: RM06L/def2SVPFreq
converged: YES YES YES YES
title: Mulliken charges:
elementType: Pd O N C H H C C C H H H O O N C C C C C C C H H H C C C C H H C C O C H H C H H H H N H C N O H C H H H H C H O H
charge: 0.481448 -0.490122 -0.521054 0.068926 0.093428 0.095526 0.338987 0.277729 -0.092079 0.103185 0.086508 0.101436 -0.430180 -0.407501 -0.016252 0.108764 -0.288099 0.359187 0.025224 -0.169509 -0.068555 -0.000245 0.076480 0.074152 0.080381 -0.032069 -0.025748 -0.002001 -0.024295 0.073681 0.082829 -0.320587 -0.026851 -0.407552 0.138665 0.066819 0.079479 0.119796 0.062969 0.073440 0.337097 0.073598 -0.321319 0.173452 0.329487 -0.320554 -0.472445 0.177998 0.033405 0.057706 0.066921 0.058960 0.071118 0.257899 0.057883 -0.342123 0.014581
chargesum: -0.00000
title: Mulliken charges with hydrogens summed into heavy atoms:
elementType: Pd O N C C C C O O N C C C C C C C C C C C C C O C C N C N O C C O
charge: 0.481448 -0.490122 -0.521054 0.257880 0.338987 0.277729 0.199050 -0.430180 -0.070404 -0.016252 0.108764 -0.288099 0.359187 0.098664 -0.093029 0.005598 0.080136 0.041529 0.047932 0.080827 -0.009714 -0.320587 -0.026851 -0.407552 0.284963 0.253882 -0.147867 0.329487 -0.142556 -0.472445 0.216992 0.315782 -0.342123
chargesum: 0.00000
polarizability: 6.39458042e+02 -4.36599743e+01 4.41337107e+02 -6.86279230e+01 3.47720079e+01 3.87500262e+02
1716.lowfreq: -1595.4048 -3.8551 -0.0009 -0.0005 0.0005 0.8193 10.0266 16.5016 22.2774
frequency: -1595.4047 15.8415 21.7607 25.2065 36.3415 42.2260 47.4264 56.4242 67.7400 76.1110 78.7376 83.4927 88.8956 96.1947 105.2308 107.9273 117.1108 123.8473 129.7303 141.0743 149.0288 159.0936 163.5332 175.2439 179.6051 212.2384 219.0697 226.9376 229.8924 236.9197 257.9681 274.6102 275.9485 285.1066 289.0715 309.8156 340.0003 362.7811 378.7812 413.4070 417.5322 429.4918 447.4058 450.7263 463.5604 472.4129 492.9028 506.5864 515.8461 520.5085 557.3438 574.8745 590.7223 594.9517 606.7863 611.6563 615.9019 641.9107 668.8354 690.8913 700.1041 737.7989 757.4335 757.8219 767.1912 769.5469 775.6431 780.5674 821.3407 844.6857 868.4692 903.2751 904.7142 943.3852 946.9433 953.1974 969.6883 982.2213 983.3624 985.3142 1010.2986 1012.2391 1023.9581 1025.8478 1027.5455 1039.7549 1053.0894 1064.4202 1074.6472 1099.8584 1115.0083 1129.7403 1132.9650 1134.7240 1155.1239 1166.6920 1172.4943 1179.9547 1195.8285 1235.0473 1237.5569 1238.2757 1238.8617 1256.8504 1274.8994 1285.1120 1288.5060 1307.2085 1317.3120 1321.2939 1321.4406 1348.6686 1370.3725 1385.4004 1398.2001 1402.0999 1408.4258 1411.1797 1414.5292 1415.2926 1418.3750 1426.2883 1431.9567 1442.4866 1452.1529 1460.4054 1464.2281 1486.7407 1488.3840 1513.3600 1526.9418 1528.6651 1592.7325 1616.0145 1632.8920 1635.6934 1639.9166 1664.8766 1743.3099 1747.2740 1758.4795 2339.1547 2924.4613 3016.4543 3026.4647 3029.4386 3057.5937 3071.3166 3090.3556 3109.4892 3126.6017 3148.7169 3165.2915 3166.9749 3170.1838 3182.4588 3182.7785 3189.2640 3194.6314 3200.1079 3209.3698 3214.7017 3229.4509 3570.7215 3582.7923
redmass: 1.0994 7.2208 4.9928 5.6720 5.8024 5.9587 6.5743 6.0644 4.7497 5.9127 5.3287 3.6417 3.6142 1.5798 6.6554 5.0664 3.5216 6.9082 1.1411 5.8084 3.9021 4.0981 4.5827 5.4867 7.0487 5.5889 3.8653 6.2526 4.0564 3.4186 5.8324 4.0827 4.8353 4.2879 4.3397 8.0047 6.2958 2.6691 8.6159 4.8440 4.4905 1.1924 6.4356 3.5563 3.4363 4.6422 4.1481 1.7354 2.9143 2.5552 3.2540 2.6439 5.2586 4.4059 3.1139 5.4759 5.5547 6.2321 5.3304 5.2975 3.4383 6.9680 3.3725 3.0102 1.4645 1.3638 5.7390 4.9149 3.8301 4.6090 1.5001 3.0547 1.2914 2.5948 3.3120 4.4984 1.3637 2.4129 2.4264 1.4452 1.3186 1.7246 1.7735 4.3380 1.3737 1.9183 2.0110 3.6561 2.0103 2.3821 1.5681 2.4456 1.3200 1.6182 1.0801 1.1155 1.8421 4.0219 1.2243 2.5024 2.4695 2.1534 1.1795 1.1814 1.6192 1.7695 1.3609 1.4039 1.9947 1.6837 1.2556 1.3161 2.2914 1.3909 1.2990 1.0933 1.8810 2.9573 1.4156 1.1267 1.0558 2.4061 1.7785 1.1236 1.1333 1.0732 2.2383 2.8590 2.5704 6.8117 1.5857 2.6155 2.6756 5.9968 5.8577 7.0290 7.4783 6.5566 12.0433 9.2880 8.4204 12.6816 1.0847 1.0438 1.0618 1.0595 1.0398 1.0646 1.1042 1.1085 1.0975 1.1051 1.1027 1.0876 1.0902 1.1048 1.0935 1.0887 1.0997 1.0916 1.1063 1.0992 1.0940 1.0796 1.0799
irintensity: 4831.4276 2.6874 0.9097 2.3499 7.0320 1.3149 1.0447 4.4594 7.1672 8.9370 6.4366 15.2639 11.6993 7.7978 3.9898 1.7351 5.3055 5.4027 1.4915 8.6455 0.5595 8.6361 1.3381 4.5356 2.3212 3.5279 0.6496 5.8151 2.6822 10.0517 25.1848 17.4933 4.4538 9.5475 14.1817 10.3900 1.1669 22.5706 113.1952 3.7755 10.8446 41.3615 3.9218 21.6699 8.2934 7.7374 30.3174 165.6551 42.6918 71.8771 18.6908 9.8031 8.3546 21.7741 12.2065 0.8967 19.9420 13.2037 29.6718 17.0329 11.8302 30.7862 5.0201 12.5648 113.4570 44.3413 4.3642 16.3500 1.1693 41.1511 6.5496 33.1995 1.5581 9.3955 8.7390 17.9271 2.9424 6.5567 45.9820 4.0511 0.4346 3.3150 18.4767 11.1572 0.9480 16.0495 3.6259 115.1380 13.2823 0.4959 13.2977 1.0995 20.6909 45.7194 3.0366 46.1364 12.4088 92.6951 16.1916 31.7172 96.6114 48.5934 10.5979 62.5550 251.8937 65.1953 492.3936 63.7046 265.5884 448.0053 127.3789 44.0731 380.4709 10.9729 12.7257 39.9843 25.6572 43.0831 137.2524 18.1303 17.8946 43.4486 34.0536 32.9931 60.0778 13.4102 19.5338 73.1926 0.3312 28.8093 12.0215 183.0212 818.1743 2.9419 104.1674 85.0325 670.4796 207.8909 1513.5418 795.0626 412.6260 299.0622 112.6575 117.2754 51.6620 50.7619 13.4698 40.1094 7.3328 43.3064 31.9441 9.9103 0.8223 0.5047 9.0761 12.7348 8.9604 5.7302 32.5957 2.7392 4.8690 11.5306 0.8192 33.0376 493.9217
temp: 298.150 k
press: 1.00000 atm
elementType: 46 8 7 6 1 1 6 6 6 1 1 1 8 8 7 6 6 6 6 6 6 6 1 1 1 6 6 6 6 1 1 6 6 8 6 1 1 6 1 1 1 1 7 1 6 7 8 1 6 1 1 1 1 6 1 8 1
symmnumber: 1
zpe: 1143537.8 jmol-1
zpe.correction: 0.435551 hartree
zpe.thermalcorrener: 0.469100 hartree
zpe.thermalcorrenthalpy: 0.470044 hartree
zpe.thermalcorrgfe: 0.367281 hartree
zpe.sumelectzpe: -1649.499242 hartree
zpe.sumelectthermal: -1649.465692 hartree
zpe.sumelectthermalent: -1649.464748 hartree
zpe.sumelectthermalfe: -1649.567511 hartree
dipole: -4.2728 2.7184 9.3815
dipole: 10.6611
quadrupole: -220.1647 -188.4440 -216.8579
quadrupole: -54.8009 23.5104 15.5696
quadrupole: -11.6759 20.0449 -8.3690 -54.8009 23.5104 15.5696
hfenergy: -1649.9347921 hartree
pointgroup: C01 [X(C22H24N4O6Pd1)]
dipole: -1.6761493 1.0663763 3.69409 debye
polarizability: 639.1756032|-43.923503|441.3942168|-68.8169987|35.0434784|387.7255906 unknown
InChI: InChI=1/22C.4N.6O.Pd.24H
charge 0 multiplicity 1
57 atoms
Pd 2.22583351 0.44185389 -0.16568504
O  3.22113066 1.26069097 -1.78963396
N  3.94608379 -0.57143355 -0.01315702
C  4.92245022 -0.25577919 -1.03483552
H  5.86829334 0.10797289 -0.59797374
H  5.1895606 -1.14474326 -1.63262605
C  4.42010419 0.80641985 -1.99319057
C  4.19709556 -1.44147383 0.94422986
C  5.52053113 -2.13353382 0.99283166
H  6.33007833 -1.40154101 1.12303891
H  5.54693687 -2.84656197 1.82208906
H  5.71900883 -2.66394408 0.05155235
O  5.1333909 1.19841482 -2.91022704
O  3.34230176 -1.71519972 1.84809425
N  0.52536768 1.57099902 -0.39204339
C  -0.48877853 2.11403966 -0.2134256
C  -1.6961209 2.79611255 0.05520085
C  -2.92917487 2.2291501 -0.35917412
C  -1.66987457 4.01328551 0.76061191
C  -4.11564612 2.90789792 -0.05788313
C  -2.85520237 4.67130659 1.05187752
C  -4.06769051 4.11236317 0.63917854
H  -5.07774076 2.49713279 -0.36359066
H  -2.83738166 5.61542266 1.59823443
H  -5.00523368 4.62575256 0.86554398
C  -0.41363396 0.72789231 3.0535586
C  -1.46423157 -0.06184522 2.56884304
C  0.86923521 0.5875195 2.52940955
C  -1.22736004 -1.01635907 1.58425736
H  -2.47232199 0.06827764 2.97053682
H  1.67875344 1.22109116 2.90402559
C  1.132168 -0.34734379 1.51150358
C  0.06442823 -1.16616273 1.06159653
O  -2.85937451 1.06669477 -1.01770014
C  -4.06966282 0.50468165 -1.54052314
H  -4.7643637 0.28711482 -0.71211814
H  -4.55054238 1.23467882 -2.21188759
C  -3.72060372 -0.75350039 -2.2923397
H  -4.63021253 -1.09756175 -2.8039029
H  -0.70642571 4.42244668 1.0702421
H  2.28648443 -0.97698378 1.61205526
H  -0.60660132 1.46508507 3.83737143
N  -3.21137264 -1.81900966 -1.47224202
H  -2.22020583 -1.8390576 -1.24501334
C  -4.05141979 -2.6668865 -0.80387686
N  -3.42559407 -3.55208825 0.02676362
O  -5.27884399 -2.62869385 -0.93413704
H  -2.41386271 -3.62627268 -0.04400951
C  -4.1534096 -4.62388843 0.64868481
H  -4.44634281 -5.42081758 -0.0566927
H  -3.53478387 -5.07732319 1.43163152
H  -5.07056796 -4.24675713 1.11999242
H  -2.98351849 -0.52046271 -3.07409346
C  0.34995721 -2.16843908 0.02942024
H  1.43671536 -2.29405065 -0.20600868
O  -0.48462259 -2.84593961 -0.55083131
H  -2.03688368 -1.65327927 1.21578359
