program: Gaussian 16
title: titulo
version: EM64L-G16RevC.01
frameworkgroup: C1[X(C22H21F3N4O6Pd)]
method: RM06L
basis: def2SVP
operation: Freq
keyword: #P
keyword: Geom=AllCheck
keyword: Guess=TCheck
keyword: SCRF=Check
keyword: Test
keyword: GenChk
keyword: RM06L/def2SVPFreq
converged: YES YES YES YES
title: Mulliken charges:
elementType: Pd O N C H H C C C H H H O O N C C C C C C C H H H C C C C H H C C O C H H C H H H H N H C N O H C H C H O H F F F
charge: 0.482583 -0.489866 -0.521137 0.069625 0.094671 0.094572 0.339456 0.278451 -0.092328 0.102064 0.086657 0.102937 -0.429370 -0.407857 -0.014146 0.108381 -0.289474 0.359255 0.026901 -0.168132 -0.067728 -0.000269 0.077193 0.074669 0.080895 -0.030453 -0.025844 -0.000974 -0.029833 0.075484 0.084154 -0.318854 -0.027088 -0.410181 0.142233 0.072045 0.084195 0.118414 0.073627 0.073706 0.337622 0.074987 -0.307423 0.187627 0.361563 -0.339889 -0.429815 0.209996 0.709041 0.079524 0.266003 0.062349 -0.351623 0.028710 -0.227942 -0.216370 -0.222993
chargesum: -0.00000
title: Mulliken charges with hydrogens summed into heavy atoms:
elementType: Pd O N C C C C O O N C C C C C C C C C C C C C O C C N C N O C C O F F F
charge: 0.482583 -0.489866 -0.521137 0.258868 0.339456 0.278451 0.199330 -0.429370 -0.070236 -0.014146 0.108381 -0.289474 0.359255 0.100607 -0.090939 0.006941 0.080626 0.044534 0.049640 0.083180 -0.001123 -0.318854 -0.027088 -0.410181 0.298473 0.271565 -0.119796 0.361563 -0.129893 -0.429815 0.709041 0.328352 -0.351623 -0.227942 -0.216370 -0.222993
chargesum: 0.00000
polarizability: 5.92678831e+02 -8.79285993e+01 4.76960946e+02 -5.42748449e+01 5.66530073e+01 3.87647762e+02
1716.lowfreq: -1599.2933 -8.7376 0.0006 0.0008 0.0011 4.6053 9.9604 16.0124 17.2307
frequency: -1599.2933 14.7258 16.5846 20.8554 29.3132 37.0208 38.7969 48.4661 55.1674 59.8617 72.1951 76.8066 79.9629 83.8220 103.7423 104.7595 109.7727 122.1517 136.2580 143.2735 150.2388 160.2772 169.0064 182.8162 190.1617 200.1103 216.2249 218.1452 228.2795 244.6682 250.5648 259.1882 277.8459 283.1059 287.8808 311.6374 317.2459 341.9813 372.7319 382.4257 395.9806 407.0153 414.0189 419.4606 449.6839 456.1653 464.7947 475.6116 489.7964 493.5243 514.7916 543.9393 548.6096 552.8690 581.6346 590.9966 596.4360 604.9518 608.4360 612.8280 616.0118 641.2171 668.0875 683.6589 689.6890 737.2342 744.2749 756.4373 757.9306 765.9346 768.0226 773.8248 788.2953 832.2329 845.1826 867.8027 899.3434 905.6883 924.8874 949.8635 954.8977 956.0243 970.0543 983.2345 987.2907 1008.3706 1013.5061 1025.0417 1026.2850 1028.1501 1041.5582 1049.2477 1054.4645 1072.1203 1076.4308 1116.6500 1129.9151 1131.3258 1133.7829 1155.1189 1165.4571 1167.9681 1179.2660 1185.8171 1198.5655 1236.8434 1240.5653 1242.3092 1251.4537 1268.1864 1284.4310 1288.6127 1307.2277 1309.1032 1322.9101 1323.6211 1338.3986 1350.6121 1371.6624 1386.2956 1401.5992 1410.7521 1411.3561 1414.1094 1415.5793 1429.1263 1433.1000 1436.3800 1455.9872 1464.6281 1486.3588 1489.2737 1514.6298 1528.7676 1533.3344 1580.5417 1615.3822 1633.7770 1636.0904 1639.2796 1664.8935 1742.9724 1747.3045 1792.8740 2341.1156 2933.3295 3025.4568 3032.2924 3057.7943 3080.8598 3089.8619 3112.9238 3161.4545 3166.4392 3169.7934 3178.9280 3186.5404 3189.3565 3196.6397 3199.7015 3208.6390 3213.9032 3228.3169 3461.5356 3583.7739
redmass: 1.0989 7.1202 8.4723 6.5340 9.1319 5.9701 8.1748 10.0873 10.5766 10.4154 7.5843 5.9069 6.2680 3.9715 6.6130 4.8609 9.4764 7.3665 8.7865 4.1977 2.9844 4.0376 7.7826 7.6760 3.5593 1.7030 5.8500 3.9281 6.1375 4.8201 3.3295 7.0226 6.0975 6.8850 4.1078 6.8043 3.8225 6.5138 7.4988 8.4059 3.7089 4.3826 4.6859 5.8422 6.0455 1.6506 2.7198 3.9670 5.3254 4.2781 3.3905 5.3909 1.4087 4.1452 2.6769 5.2495 4.4252 8.1819 3.1713 5.7639 5.0939 6.1147 5.3495 7.3994 5.4533 7.1268 3.5219 2.8031 3.3681 1.4935 1.3808 6.9873 5.8255 4.7877 4.6239 1.5040 6.6059 1.2877 3.1490 3.3966 4.8791 2.9390 1.3623 2.3830 1.4333 1.3210 1.7609 2.2725 1.7278 2.0253 2.8065 1.6986 2.0415 2.6944 2.3830 1.5643 4.0269 3.9541 1.6201 1.0866 2.8567 1.1818 4.0683 3.5085 1.2187 2.2372 2.7567 1.0922 2.1646 1.2646 1.8929 1.3568 1.5065 1.4057 1.8773 1.7810 2.2631 1.2546 2.2158 1.3582 1.4937 1.5518 2.6734 1.8095 1.3068 1.8309 1.0406 1.5760 1.1598 2.1934 2.8766 2.5956 6.3443 2.8117 1.6707 2.5979 6.0314 5.8366 7.0449 7.4106 6.5449 11.4906 9.7907 9.1772 12.6817 1.0850 1.0623 1.0598 1.0395 1.0651 1.1042 1.1083 1.1053 1.1027 1.0875 1.0885 1.0944 1.0885 1.1001 1.0918 1.1064 1.0993 1.0941 1.0825 1.0797
irintensity: 4770.1810 3.4232 1.4036 0.6100 1.1601 2.5986 3.0630 1.5336 7.6487 4.1862 2.0782 2.9971 4.0954 17.4729 5.1377 4.7299 5.4635 5.3164 1.2099 2.1470 1.7801 4.9453 10.9511 1.4921 4.6127 2.7035 5.2818 1.6658 2.5401 16.3753 14.6766 15.5759 3.2566 11.9413 19.4907 6.0439 1.6031 0.3312 2.3594 103.1104 17.4643 21.1947 8.4119 4.0766 9.8156 48.7861 14.7971 8.9146 10.6046 31.1815 7.3177 7.9499 184.3753 49.3342 11.9340 8.4121 20.9007 3.2076 7.8402 2.7623 18.4125 18.7986 34.2108 57.5480 19.7497 31.0969 9.7942 4.6505 17.2797 109.9788 42.6736 9.0533 15.3781 8.9448 44.2818 7.5647 128.2827 0.9347 57.6658 19.1707 7.6318 11.3734 2.7327 7.1654 4.4989 0.3881 2.8302 10.5315 17.1961 4.0794 80.5493 13.0200 3.1152 94.4231 30.0951 10.0748 271.8503 295.7223 34.3101 8.0718 188.3100 37.4268 81.6787 285.5800 15.6545 172.8896 5.3783 1.9414 338.9583 118.2758 75.3778 490.1359 210.9589 59.7136 363.2087 458.6930 139.5686 31.5983 366.4630 19.3080 21.1383 118.1394 38.5903 30.2631 69.8119 46.4166 17.7247 40.0643 40.5988 19.5124 74.9897 1.1346 30.7386 164.4325 184.6266 765.9204 1.0691 132.3180 86.6123 657.4417 207.6734 1440.8553 872.8252 641.8803 287.0883 96.8766 53.0172 45.6793 14.3669 26.6971 7.9157 38.4491 4.9571 0.7575 4.3764 3.2485 11.8240 5.9079 30.1643 2.9182 5.7467 10.7272 1.1216 682.3462 342.3111
temp: 298.150 k
press: 1.00000 atm
elementType: 46 8 7 6 1 1 6 6 6 1 1 1 8 8 7 6 6 6 6 6 6 6 1 1 1 6 6 6 6 1 1 6 6 8 6 1 1 6 1 1 1 1 7 1 6 7 8 1 6 1 6 1 8 1 9 9 9
symmnumber: 1
zpe: 1084204.1 jmol-1
zpe.correction: 0.412952 hartree
zpe.thermalcorrener: 0.447887 hartree
zpe.thermalcorrenthalpy: 0.448832 hartree
zpe.thermalcorrgfe: 0.341892 hartree
zpe.sumelectzpe: -1946.998180 hartree
zpe.sumelectthermal: -1946.963244 hartree
zpe.sumelectthermalent: -1946.962300 hartree
zpe.sumelectthermalfe: -1947.069240 hartree
dipole: -0.7644 7.0054 8.1836
dipole: 10.7996
quadrupole: -279.9127 -183.6743 -228.3129
quadrupole: -56.5728 33.3865 14.0438
quadrupole: -49.2794 46.9590 2.3204 -56.5728 33.3865 14.0438
hfenergy: -1947.4111317 hartree
pointgroup: C01 [X(C22H21F3N4O6Pd1)]
dipole: -0.2991309 2.7438937 3.2302512 debye
polarizability: 592.5904283|-87.7588354|476.5973493|-54.6191003|57.0291887|388.0997616 unknown
InChI: InChI=1/22C.3F.4N.6O.Pd.21H
charge 0 multiplicity 1
57 atoms
Pd 2.67484102 0.08114358 -0.13817682
O  3.85702635 0.64508862 -1.74351882
N  4.02672994 -1.3931514 -0.0545749
C  5.05300145 -1.32598 -1.07369472
H  6.06228634 -1.25643737 -0.6322311
H  5.06280722 -2.23082669 -1.70571101
C  4.86990768 -0.12984985 -1.98712008
C  4.00469219 -2.3498378 0.85158698
C  5.05347387 -3.41433839 0.83626109
H  6.05423091 -2.97453933 0.94740447
H  4.88342178 -4.12710466 1.64855317
H  5.04537552 -3.95195999 -0.1220484
O  5.65611987 0.07347119 -2.90554948
O  3.10739006 -2.40242707 1.75407542
N  1.382005 1.66749609 -0.29893541
C  0.57497658 2.4849725 -0.11143243
C  -0.38503547 3.48658966 0.15397074
C  -1.71289207 3.31820866 -0.31620698
C  -0.02944245 4.62623017 0.89800821
C  -2.65796223 4.31066217 -0.03425208
C  -0.97946937 5.59890279 1.17104232
C  -2.28504583 5.43269284 0.70140372
H  -3.68517202 4.2080718 -0.3838491
H  -0.70623558 6.48445797 1.74666369
H  -3.03770551 6.19588905 0.9126957
C  0.22737347 0.98430989 3.11356265
C  -1.00735001 0.55131893 2.61345203
C  1.4142021 0.49839531 2.5699368
C  -1.05736357 -0.39367258 1.59345684
H  -1.93408291 0.95118785 3.03222149
H  2.3727423 0.85524711 2.95805942
C  1.39444363 -0.43055358 1.51375994
C  0.13509697 -0.89028598 1.04868158
O  -1.95987603 2.19882351 -1.00798523
C  -3.24819448 2.03629952 -1.61201271
H  -4.02423817 1.99958271 -0.82901494
H  -3.45875253 2.89585547 -2.26858518
C  -3.22829145 0.76058465 -2.41079403
H  -4.17399529 0.68818393 -2.96347294
H  0.99880413 4.72695143 1.24988892
H  2.31716167 -1.37152475 1.56923264
H  0.25678742 1.71516519 3.92597809
N  -3.06518142 -0.42674642 -1.61056955
H  -2.12941885 -0.70678723 -1.32645258
C  -4.1319799 -1.09491613 -1.10934999
N  -3.77634285 -2.16840254 -0.29976825
O  -5.30097769 -0.80323501 -1.32984903
H  -2.79197258 -2.44209591 -0.2261885
C  -4.73020799 -3.05003653 0.20400904
H  -2.42068344 0.80128753 -3.15501828
C  0.1193966 -1.9010922 -0.01151755
H  1.12721147 -2.29700735 -0.29191911
O  -0.87945437 -2.3262786 -0.57518288
H  -2.01786063 -0.7552462 1.21716286
F  -5.43994323 -3.68382059 -0.74857502
F  -4.11178672 -3.98758998 0.92941775
F  -5.63314194 -2.44940799 0.99434558
