program: Gaussian 16
title: titulo
version: EM64L-G16RevC.01
frameworkgroup: C1[X(C18H16N2O4Pd)]
method: RM06L
basis: def2SVP
operation: Freq
keyword: #P
keyword: Geom=AllCheck
keyword: Guess=TCheck
keyword: SCRF=Check
keyword: Test
keyword: GenChk
keyword: RM06L/def2SVP
keyword: Freq
converged: YES YES YES YES
title: Mulliken charges:
elementType: Pd O N C H H C C C H H H O O N C C C C C C C H H H C C C C H H C C H H H C H O H H
charge: 0.485454 -0.490754 -0.525065 0.069401 0.094211 0.093348 0.338438 0.279151 -0.092509 0.100706 0.086047 0.103275 -0.430598 -0.413495 -0.018327 0.106282 -0.225576 0.015859 0.024421 -0.046029 -0.047169 -0.024667 0.078758 0.079786 0.080719 -0.033133 -0.036607 -0.006071 -0.027360 0.076679 0.081642 -0.296478 -0.063727 0.079530 0.335353 0.073867 0.248554 0.045453 -0.333124 0.056145 0.077607
chargesum: -0.00000
title: Mulliken charges with hydrogens summed into heavy atoms:
elementType: Pd O N C C C C O O N C C C C C C C C C C C C C C O
charge: 0.485454 -0.490754 -0.525065 0.256960 0.338438 0.279151 0.197520 -0.430598 -0.413495 -0.018327 0.106282 -0.225576 0.093467 0.103951 0.032729 0.032617 0.056053 0.040734 0.040072 0.075571 0.028785 0.038876 -0.063727 0.294007 -0.333124
chargesum: 0.00000
polarizability: 5.44482468e+02 -7.13701474e+01 3.88932318e+02 -1.01253806e+01 -9.33530578e+00 2.70604303e+02
1716.lowfreq: -1571.1611 -4.9810 0.0002 0.0005 0.0006 8.0726 15.4771 21.0458 21.4006
frequency: -1571.1611 20.6086 21.3795 29.3647 35.9202 44.5391 68.2094 78.4831 83.6592 96.8877 109.5991 123.5245 135.4856 139.6539 163.2485 171.5996 184.6176 208.7633 215.2329 237.2456 251.8616 271.7528 282.6979 288.5579 322.5537 343.6652 382.1691 405.6040 410.9673 448.1950 462.6963 470.3922 494.4198 515.9621 576.1172 577.4228 581.0730 596.0129 606.6824 635.0368 640.2345 670.0057 690.5977 703.8920 737.2926 759.6980 768.0804 775.5031 795.2097 842.3930 855.7362 899.2583 949.2547 951.5020 954.2215 982.7675 983.4362 999.6188 1014.3560 1016.8201 1023.9816 1025.2256 1025.7141 1028.7245 1042.8609 1050.5082 1051.2297 1101.9551 1106.6825 1153.0194 1158.0111 1176.4254 1182.7128 1189.5922 1232.7850 1241.3617 1250.3569 1280.7674 1309.1665 1318.5845 1326.0737 1348.8706 1371.7664 1405.7636 1406.9028 1407.4620 1416.9642 1424.1138 1426.6573 1464.7790 1473.3835 1486.9735 1516.0305 1518.8464 1618.2032 1636.4395 1637.0976 1641.4426 1665.8286 1743.1986 1780.9428 2356.7107 2883.3104 3024.6754 3057.6612 3088.2081 3165.5758 3168.4690 3177.3561 3186.0908 3186.4810 3196.2558 3197.0819 3201.4762 3208.4200 3209.8991 3212.2258
redmass: 1.1034 6.7107 4.3684 6.0083 5.4020 8.0582 5.5676 3.9690 5.6947 6.9186 5.8145 5.9359 3.6322 2.1371 5.4612 2.0387 7.1341 4.9615 4.5466 3.3737 6.1410 6.1565 3.9112 6.1396 9.6360 6.3451 8.9300 2.8559 4.7336 6.3415 4.0711 4.5011 4.0740 8.7488 2.8770 4.7037 5.7947 4.3893 2.9910 6.9698 6.3002 5.4027 5.1091 1.7539 7.0084 3.3634 1.3911 1.9539 5.9994 4.5769 1.2479 1.3003 3.3433 1.3727 4.6504 2.3911 1.4142 1.3802 5.8303 1.8164 1.3950 1.7504 1.3273 4.5411 1.8347 1.9125 2.0441 1.4299 1.5460 1.0936 1.0643 1.1100 4.1730 1.1832 2.3336 1.0963 3.8209 1.4171 1.3660 1.3375 1.6819 1.3002 2.1851 1.8058 1.1402 7.3250 1.3982 1.0445 2.4858 2.2563 2.5993 2.6511 6.6637 2.5144 6.1386 6.0197 6.1253 7.2342 6.2609 12.4007 9.7393 12.6926 1.0847 1.0621 1.0397 1.1040 1.1026 1.0880 1.0884 1.0941 1.0866 1.0898 1.0999 1.0944 1.1063 1.0979 1.1008
irintensity: 4610.6915 2.2838 0.6398 1.1909 2.2350 5.2729 2.5843 11.3836 6.9904 4.6120 4.8533 4.5680 2.5753 3.9829 0.1734 0.2277 8.3458 5.7637 2.5044 11.6612 18.6899 8.4932 12.6259 4.1052 2.1104 2.7091 104.1311 0.0180 4.0758 4.7583 7.8723 9.9087 21.8477 4.4508 2.3143 26.1797 13.4253 19.8424 14.3575 0.6419 11.2753 27.0440 15.4769 50.2750 35.8143 13.8055 67.1671 31.3013 2.9581 41.7168 0.0248 1.1151 12.2592 2.1214 16.4970 7.2103 5.8860 0.0700 4.7993 2.0681 0.6996 18.2332 0.0034 11.0379 17.1220 12.1358 9.4557 10.9719 12.8219 2.4713 0.5759 6.9726 95.6796 10.9418 188.2354 1.7675 15.8411 339.9069 156.0802 0.1241 652.3843 45.8831 333.0636 21.9541 24.8156 5.4424 140.5455 18.7210 33.2108 19.1622 18.0704 0.3570 40.1426 2.6754 2.4061 107.4328 0.4133 694.0986 23.8369 1226.5866 628.9738 106.6374 112.9266 52.0411 14.6503 7.7383 0.8937 5.6996 0.8789 15.5464 0.3583 2.9662 34.7578 10.8325 5.6213 8.1746 7.5707
temp: 298.150 k
press: 1.00000 atm
elementType: 46 8 7 6 1 1 6 6 6 1 1 1 8 8 7 6 6 6 6 6 6 6 1 1 1 6 6 6 6 1 1 6 6 1 1 1 6 1 8 1 1
symmnumber: 1
zpe: 791144.6 jmol-1
zpe.correction: 0.301331 hartree
zpe.thermalcorrener: 0.325454 hartree
zpe.thermalcorrenthalpy: 0.326398 hartree
zpe.thermalcorrgfe: 0.244205 hartree
zpe.sumelectzpe: -1232.742308 hartree
zpe.sumelectthermal: -1232.718185 hartree
zpe.sumelectthermalent: -1232.717241 hartree
zpe.sumelectthermalfe: -1232.799434 hartree
dipole: 8.4331 -5.6454 -5.2982
dipole: 11.4481
quadrupole: -95.8153 -189.0287 -163.1473
quadrupole: 19.6277 -0.6661 2.8023
quadrupole: 53.5151 -39.6982 -13.8169 19.6277 -0.6661 2.8023
hfenergy: -1233.0436386 hartree
pointgroup: C01 [X(C18H16N2O4Pd1)]
dipole: -3.3134059 2.2310179 -2.0808747 debye
polarizability: 544.1636254|-71.7315589|389.2354038|9.9793319|9.4725465|270.6200594 unknown
InChI: InChI=1/18C.2N.4O.Pd.16H
charge 0 multiplicity 1
41 atoms
Pd 1.04019063 -0.46004236 -0.12083174
O  1.46507185 -2.46108174 0.20761629
N  3.04078641 -0.35704505 -0.13126642
C  3.71006222 -1.62781748 0.05168794
H  4.35234136 -1.87951495 -0.81030398
H  4.37840805 -1.61642183 0.93005361
C  2.72668068 -2.76572865 0.2390013
C  3.71096908 0.77034183 -0.26811091
C  5.20499952 0.75566112 -0.23679807
H  5.60362216 0.09523363 -1.01907611
H  5.59874051 1.76578299 -0.38321788
H  5.56606246 0.36483246 0.72475746
O  3.12997529 -3.91094736 0.41031642
O  3.12080357 1.88637561 -0.42642286
N  -0.98167521 -0.74100005 -0.06452293
C  -2.13960284 -0.83829951 -0.03814719
C  -3.55359242 -0.94916227 -0.00317568
C  -4.32344018 0.13744323 0.4520564
C  -4.17306731 -2.14095513 -0.42187641
C  -5.70782487 0.02292366 0.48303588
C  -5.55873136 -2.23577283 -0.38286407
C  -6.32447039 -1.15860029 0.06714183
H  -6.31051805 0.86205299 0.83604731
H  -6.04541499 -3.15808473 -0.70608658
H  -7.41333847 -1.24119973 0.09502224
C  -1.12576543 2.6064902 -2.00654952
C  -1.75825358 3.20843252 -0.91203324
C  -0.00031003 1.80881636 -1.81364627
C  -1.25603484 3.02559454 0.37288771
H  -2.64640097 3.8254508 -1.06921677
H  0.48874883 1.34634907 -2.67616614
C  0.5149986 1.58964289 -0.52243553
C  -0.12732612 2.22154884 0.57145562
H  -3.56258608 -2.97539005 -0.77082928
H  1.81889566 1.62468439 -0.45056261
H  -1.5192155 2.76182939 -3.01429384
C  0.4057891 2.01326649 1.92771508
H  1.37133086 1.44228312 1.96090671
O  -0.12115371 2.41064906 2.94963424
H  -1.73273229 3.49573663 1.23746781
H  -3.82838517 1.05384922 0.77837817
