program: Gaussian 16
title: Busca de TS do conformero4 de ativação CH
version: EM64L-G16RevC.01
method: RM06L
basis: def2SVP
operation: Freq
keyword: #N
keyword: Geom=AllCheck
keyword: Guess=TCheck
keyword: SCRF=Check
keyword: Test
keyword: GenChk
keyword: RM06L/def2SVPFreq
converged: YES YES YES YES
title: Mulliken charges:
elementType: Pd O N C H H C C C H H H O O N C C C C C C C H H H C C C C H H C C H C H O O C H H C H H N H C N H C H H H O H H H
charge: 0.426882 -0.482376 -0.518378 0.089691 0.096239 0.072335 0.318692 0.272697 -0.086114 0.097567 0.085885 0.099921 -0.438104 -0.415494 -0.007804 0.029076 -0.270624 0.324077 0.020641 -0.101634 -0.067200 -0.007429 0.070110 0.073666 0.079941 -0.056321 -0.017715 0.015495 -0.112168 0.070253 0.086092 -0.329692 0.056657 0.043479 0.261910 0.041240 -0.330964 -0.404281 0.155631 0.080549 0.080737 0.099696 0.060679 0.067891 -0.309742 0.181511 0.343890 -0.306966 0.184311 0.038514 0.064753 0.062219 0.068308 -0.445216 0.071911 0.346115 0.068964
chargesum: -0.00000
title: Mulliken charges with hydrogens summed into heavy atoms:
elementType: Pd O N C C C C O O N C C C C C C C C C C C C C C O O C C N C N C O
charge: 0.426882 -0.482376 -0.518378 0.258265 0.318692 0.272697 0.197260 -0.438104 -0.069379 -0.007804 0.029076 -0.270624 0.324077 0.092551 -0.031523 0.006465 0.072512 0.012643 0.052538 0.101587 -0.112168 -0.329692 0.100136 0.303150 -0.330964 -0.404281 0.316916 0.228266 -0.128232 0.343890 -0.122655 0.233794 -0.445216
chargesum: 0.00000
1716.lowfreq: -1604.6607 -5.6790 -0.0008 -0.0005 -0.0004 8.1181 9.4514 17.1246 25.6863
frequency: -1604.6607 16.4519 25.6214 35.3565 41.8536 50.5337 58.3063 61.6578 64.7585 78.7292 87.5522 94.9705 98.2469 106.3204 110.0151 129.4741 137.6110 138.4313 145.2982 168.4358 172.1323 173.3701 179.4238 197.8844 207.7897 221.2303 233.2827 237.2085 244.4961 265.0043 272.1226 279.9514 290.1355 293.3175 303.6047 306.6857 335.6320 343.8103 360.4493 364.3160 383.6388 412.7372 427.4178 438.7198 446.5437 451.7745 454.0009 508.2039 514.0942 522.4575 554.4588 579.4010 579.7257 604.5462 607.6428 609.4961 646.1447 651.7796 664.7184 682.3942 715.0996 717.7717 731.7476 742.8226 743.3596 761.2565 766.9699 796.3629 802.8729 850.3263 877.3607 877.4769 937.1047 947.0816 952.9503 953.9733 966.6699 974.3240 982.9493 1006.6783 1007.6006 1010.2376 1026.0663 1041.6100 1043.4982 1045.5146 1066.0236 1073.2440 1084.3665 1101.7746 1102.9232 1123.1616 1130.3294 1142.1640 1156.2931 1159.6903 1173.5659 1179.5401 1194.3941 1228.6888 1234.2221 1235.5304 1236.7028 1247.1992 1268.6587 1270.8507 1293.2047 1295.0252 1301.2158 1309.1422 1327.0102 1353.1573 1355.9697 1379.3277 1403.8973 1404.9460 1406.5514 1413.8095 1421.0299 1426.3951 1428.6787 1429.5565 1434.8534 1452.3647 1457.3205 1460.3719 1469.1108 1487.3522 1492.8066 1518.2131 1519.5295 1524.1434 1590.9398 1620.9435 1623.3103 1638.2357 1642.8800 1673.4956 1729.1463 1737.4786 1789.8677 2342.1769 2900.3327 3015.1246 3018.6816 3023.9275 3057.0766 3083.1317 3086.6547 3105.9320 3118.0590 3157.0184 3163.8447 3166.0123 3171.3868 3176.3175 3178.1576 3188.6634 3193.3593 3195.7250 3207.5716 3208.1554 3214.6369 3615.1718 3631.2277
redmass: 1.1002 6.6750 6.3793 6.7264 7.8259 5.5193 6.6964 5.0678 5.4770 5.7731 5.1036 6.2081 9.7162 4.6653 6.0980 5.8860 3.3674 3.1514 2.8995 5.1038 1.7316 2.9216 4.5977 2.3611 2.2077 4.3591 2.5452 4.4537 3.4559 4.4040 5.9462 3.9776 4.4665 3.8127 4.4050 3.1323 4.7794 5.3165 1.9498 2.0222 9.2826 4.4040 1.3543 3.0110 6.6900 6.0560 5.9295 4.7939 4.2037 4.4467 6.2293 3.3532 3.9964 4.2357 5.5172 3.0762 5.4842 6.5947 5.7902 4.7832 2.6523 2.4470 4.6652 6.4877 3.9119 7.6866 1.2943 1.3055 1.7091 4.6852 1.4822 4.9843 1.5163 1.4382 3.1044 3.3514 2.6754 1.3460 2.3445 5.1520 1.3127 1.4266 1.7348 1.8333 1.6847 5.6206 2.0908 2.2105 2.8230 1.4715 2.9605 1.9221 1.3294 1.6687 1.0748 1.0986 1.8785 3.6351 1.2180 1.9400 2.4888 1.5654 1.5903 2.0229 1.4324 1.6297 1.2552 1.2534 1.8825 1.2743 1.6483 1.2935 1.3356 2.4601 2.1090 1.1384 1.8010 1.1624 1.4101 2.2297 3.4569 1.0882 1.0900 2.3800 1.1578 1.0841 1.7862 1.4376 2.5020 6.3320 2.4953 1.5897 2.7334 6.8962 6.0230 5.8457 7.5497 6.4863 12.2397 8.4241 9.7581 12.6825 1.0853 1.0415 1.0607 1.0687 1.0398 1.1026 1.0636 1.1042 1.0966 1.1062 1.1022 1.0878 1.0916 1.0969 1.0963 1.0872 1.0981 1.0913 1.0952 1.1062 1.1004 1.0785 1.0794
irintensity: 4957.2156 1.9014 2.0862 1.8127 6.6936 0.8387 2.8072 39.1366 2.0517 7.3786 1.9099 0.3848 28.6476 4.8738 23.6884 3.9671 2.5755 3.1877 3.9080 7.7802 1.7271 9.8329 9.0023 3.9122 3.6050 2.0729 4.1433 7.0526 13.8591 9.8267 20.4790 5.3338 1.9552 4.0540 30.5582 4.4034 9.7108 9.3185 27.7093 16.5034 109.2562 1.0918 306.4091 7.5480 1.0837 4.2429 19.0580 28.3288 8.2158 13.1126 18.7581 2.8202 12.3771 18.1949 1.1284 14.8905 1.9063 16.1045 35.9904 40.0672 9.5490 18.6222 7.8787 37.5543 2.4745 19.8481 81.4130 10.4380 43.7564 6.8420 2.9318 73.0362 9.7584 1.7977 33.5198 0.4532 17.0245 2.1620 9.9765 2.9981 0.4617 0.4810 19.4146 0.7428 4.4694 94.6209 50.6890 56.9857 16.3742 35.0027 2.9398 16.8313 5.6929 36.0668 6.6914 37.9899 23.9382 99.0325 2.9599 2.2925 130.2628 27.0936 5.4538 55.4415 141.5240 135.4725 605.6585 224.4635 173.7707 38.3388 322.4081 31.0612 8.1877 419.9921 12.9149 44.4335 47.7964 5.6093 161.4331 12.9495 26.9224 6.1740 34.3266 15.9687 26.1892 3.9770 82.3955 31.1185 1.6488 11.4111 172.0127 80.9957 822.4729 137.5941 23.4469 123.3249 732.8654 132.1802 1304.2490 436.4466 560.3751 149.1715 240.6251 97.1035 64.4177 78.3036 14.4970 10.2638 44.0715 42.0759 10.8849 19.4574 2.6909 3.8519 9.3927 7.0818 11.2503 3.2486 29.6266 3.9257 6.4627 6.2203 9.1698 68.3905 115.5574
temp: 298.150 k
press: 1.00000 atm
elementType: 46 8 7 6 1 1 6 6 6 1 1 1 8 8 7 6 6 6 6 6 6 6 1 1 1 6 6 6 6 1 1 6 6 1 6 1 8 8 6 1 1 6 1 1 7 1 6 7 1 6 1 1 1 8 1 1 1
symmnumber: 1
zpe: 1144766.4 jmol-1
zpe.correction: 0.436019 hartree
zpe.thermalcorrener: 0.469095 hartree
zpe.thermalcorrenthalpy: 0.470039 hartree
zpe.thermalcorrgfe: 0.370261 hartree
zpe.sumelectzpe: -1649.491409 hartree
zpe.sumelectthermal: -1649.458333 hartree
zpe.sumelectthermalent: -1649.457388 hartree
zpe.sumelectthermalfe: -1649.557167 hartree
dipole: -3.2994 2.1441 -3.5699
dipole: 5.3129
quadrupole: -145.8920 -203.7356 -219.5719
quadrupole: -7.3478 10.1480 -26.8837
quadrupole: 43.8412 -14.0025 -29.8387 -7.3478 10.1480 -26.8837
hfenergy: -1649.9274276 hartree
pointgroup: C01 [X(C22H24N4O6Pd1)]
dipole: -1.3069161 0.8283086 -1.4053906 debye
polarizability: 617.3097271|-73.459842|511.328663|-10.3371666|-1.2128753|335.6462745 unknown
InChI: InChI=1/22C.4N.6O.Pd.24H
charge 0 multiplicity 1
57 atoms
Pd 1.14283027 0.05442322 -0.85948949
O  1.24076455 -1.99927538 -1.17169684
N  3.12621147 -0.18762231 -0.71198024
C  3.55492038 -1.57031878 -0.7160194
H  4.24294064 -1.78264921 -1.55481496
H  4.11234471 -1.8313355 0.20004479
C  2.38157671 -2.52306499 -0.85287293
C  3.96915006 0.80683301 -0.52873238
C  5.43113278 0.53285147 -0.38671175
H  5.80473442 -0.06549954 -1.2287373
H  5.99197191 1.47065543 -0.33130624
H  5.62130813 -0.04873796 0.52708277
O  2.54283498 -3.73095227 -0.69382275
O  3.57057826 2.01515215 -0.45558111
N  -0.89480626 0.02745756 -0.93334742
C  -2.0354089 -0.17910261 -0.82717913
C  -3.43595405 -0.34337947 -0.72388749
C  -4.09248932 -1.57578747 -0.45468923
C  -4.20810558 0.8275324 -0.92992156
C  -5.49652796 -1.58089229 -0.42124746
C  -5.58797716 0.79281524 -0.88524031
C  -6.23020179 -0.42629167 -0.63340682
H  -5.98818063 -2.53394899 -0.21784797
H  -6.1641753 1.70503271 -1.04688017
H  -7.32095107 -0.47373163 -0.59750177
C  -0.58560557 3.83188628 -1.40271395
C  -1.09746417 4.05932685 -0.12618995
C  0.42358508 2.8875472 -1.58220743
C  -0.58143231 3.36293349 0.97772622
H  -1.9035449 4.78349251 0.02798419
H  0.81391987 2.70458809 -2.58828036
C  0.94940106 2.1572657 -0.49248732
C  0.44426419 2.42805572 0.78843216
H  0.82582013 1.89277399 1.66296507
C  -1.1346954 3.59715538 2.31948183
H  -1.95896954 4.3546126 2.35790787
O  -0.76119145 3.03260006 3.32938605
O  -3.52938483 -2.77617782 -0.24404112
C  -2.13154115 -2.95899943 -0.02330367
H  -1.97745378 -4.0408493 -0.13551113
H  -1.53480208 -2.48042741 -0.81158876
C  -1.73265118 -2.50294135 1.36861724
H  -2.03296453 -1.45900427 1.54205271
H  -2.2856382 -3.10820011 2.10876661
N  -0.31196118 -2.57659357 1.56611274
H  0.1788864 -3.39664935 1.22305463
C  0.42105932 -1.50584246 2.00210077
N  1.7697346 -1.70608123 2.05034692
H  2.13950984 -2.6384102 1.90086248
C  2.64439693 -0.69061603 2.57117171
H  2.52744503 0.25872512 2.02475241
H  2.47128799 -0.48222274 3.64030904
H  3.68363432 -1.01971596 2.4573803
O  -0.09204473 -0.43253825 2.33548741
H  -3.67967971 1.76199411 -1.13061653
H  2.25855338 1.98767897 -0.52234396
H  -0.98045566 4.3841033 -2.25879899
