program: Gaussian 16
title: otimização de geometria e frequência do hdch3_teste_solvente
version: EM64L-G16RevC.01
frameworkgroup: C1[X(C16H15N3O2)]
method: RM06L
basis: def2SVP
operation: Freq
keyword: #P
keyword: Geom=AllCheck
keyword: Guess=TCheck
keyword: SCRF=Check
keyword: Test
keyword: GenChk
keyword: RM06L/def2SVP
keyword: Freq
converged: YES YES NO YES
title: Mulliken charges:
elementType: C O C H H C H H C C C C C H C H C N N N H H O H H C C C C H C H C H H H
charge: 0.361688 -0.432947 0.107650 0.064899 0.074785 0.158299 0.067453 0.068519 0.349433 -0.268611 -0.175301 0.019130 -0.007902 0.072119 -0.073029 0.076143 0.050340 -0.106319 -0.198132 -0.319398 0.184039 0.189772 -0.410523 0.067893 0.070413 0.132118 -0.098605 -0.118632 -0.056686 0.049703 -0.047398 0.045961 -0.074678 0.061233 0.060146 0.056421
chargesum: -0.00000
title: Mulliken charges with hydrogens summed into heavy atoms:
elementType: C O C C C C C C C C C N N N O C C C C C C
charge: 0.361688 -0.432947 0.247334 0.294272 0.349433 -0.268611 -0.103182 0.087023 0.068241 -0.002616 0.050340 -0.106319 -0.014093 -0.129626 -0.410523 0.132118 -0.048902 -0.072670 0.004547 0.012748 -0.018256
polarizability: 3.41895619e+02 -3.10196010e+01 2.50266252e+02 1.58021726e+01 -1.28708502e+00 2.13079053e+02
1716.lowfreq: -8.8771 0.0007 0.0008 0.0008 1.0470 5.8683 15.2695 21.2703 22.5880
frequency: 14.3948 20.9443 22.5445 49.2044 62.7814 65.1348 89.6558 127.1656 151.7221 156.2491 165.7861 225.7212 245.5869 247.6889 309.1585 317.0038 354.0594 379.4603 399.0189 408.2484 420.1317 462.1456 514.1869 517.8214 520.2669 568.0441 599.6596 602.8578 623.1664 625.6946 644.2782 713.1685 733.3734 758.7198 759.8061 765.9907 769.3308 771.1934 827.9352 839.8505 850.8299 867.4090 874.6215 905.7506 966.8054 984.2585 1003.3042 1003.9729 1007.0156 1009.4707 1054.8019 1056.1439 1074.2407 1102.7563 1110.5195 1131.7253 1144.7223 1151.2777 1165.3065 1170.4296 1178.3816 1229.0753 1243.8660 1276.1020 1285.8273 1310.9244 1318.1060 1328.7356 1333.2847 1346.4573 1407.1837 1415.1011 1421.9305 1439.6993 1465.8123 1474.2929 1486.9661 1531.2849 1532.3436 1556.9318 1583.4727 1640.6408 1659.8270 1667.7716 1675.1279 1768.6409 2325.4621 3018.9079 3071.6311 3094.7807 3149.8734 3168.0957 3175.7962 3184.6168 3186.9769 3197.3877 3198.8672 3211.7100 3222.3143 3252.6222 3609.8910 3634.7496
redmass: 5.0074 5.0146 5.7206 6.4642 5.8872 5.8216 8.5166 5.1624 4.4041 2.2838 6.6731 5.2821 5.0255 5.6566 3.5174 4.9403 6.7376 1.1606 4.7313 4.0943 2.9711 7.1896 3.2953 5.4700 2.8850 1.1860 4.9881 7.2063 6.3153 6.3452 5.3899 1.7541 2.4175 3.3064 2.4315 2.0983 5.9258 2.0559 1.6073 1.2597 6.0574 1.5678 4.3824 1.4725 1.3648 1.3478 1.2795 1.3349 3.3177 5.0883 2.2717 4.5913 1.9636 1.4745 2.9060 1.6388 1.9895 1.0684 1.1406 3.0383 1.1192 2.8310 1.2380 1.5997 1.8930 2.0830 2.0564 1.5713 1.1398 1.4244 6.5961 5.3311 1.1243 1.7022 1.1628 2.5412 2.6808 2.5131 2.7144 1.8980 2.3284 7.1000 4.4925 6.6968 6.3614 7.9652 12.6626 1.0589 1.0627 1.1092 1.1069 1.0877 1.0887 1.0946 1.0882 1.0918 1.1000 1.0989 1.0946 1.0930 1.0782 1.0794
irintensity: 3.4712 1.0556 1.6956 24.4583 1.1352 3.9350 4.5161 0.5068 4.8745 3.4735 6.9830 2.1597 2.7799 2.0014 19.4066 18.6877 4.3765 92.5977 17.7472 0.8717 0.0213 4.6518 12.6739 12.8431 34.4811 145.5720 6.7022 7.3627 4.8254 0.0763 1.8147 52.9354 11.2249 14.1321 19.3075 62.5803 9.3308 62.6841 3.1209 0.1538 11.7126 3.7420 9.3240 9.9904 2.6175 0.0115 0.5336 0.1326 2.6785 3.3436 64.5480 81.9398 33.2520 17.2345 7.8903 57.2499 1.8437 1.3884 38.2321 7.8264 10.3725 3.6180 185.6412 540.0395 60.3751 63.4898 355.3022 26.0308 40.6889 26.2011 52.3966 72.1119 10.0134 28.6247 98.3160 42.1865 59.6309 448.6603 63.2305 200.3467 1098.2997 55.2213 100.8313 159.4392 83.6307 491.4435 228.4278 42.3232 53.8892 28.2857 16.1393 13.4258 3.2878 33.0523 5.1136 5.7545 25.1513 12.8232 1.4036 2.7693 68.3520 133.4586
temp: 298.150 k
press: 1.00000 atm
elementType: 6 8 6 1 1 6 1 1 6 6 6 6 6 1 6 1 6 7 7 7 1 1 8 1 1 6 6 6 6 1 6 1 6 1 1 1
symmnumber: 1
zpe: 752247.6 jmol-1
zpe.correction: 0.286516 hartree
zpe.thermalcorrener: 0.305229 hartree
zpe.thermalcorrenthalpy: 0.306173 hartree
zpe.thermalcorrgfe: 0.235538 hartree
zpe.sumelectzpe: -932.407032 hartree
zpe.sumelectthermal: -932.388319 hartree
zpe.sumelectthermalent: -932.387375 hartree
zpe.sumelectthermalfe: -932.458010 hartree
dipole: -2.3172 4.4519 -8.0307
dipole: 9.4700
quadrupole: -126.1049 -127.7601 -114.1184
quadrupole: 31.2433 5.1099 10.5588
quadrupole: -3.4437 -5.0990 8.5427 31.2433 5.1099 10.5588
hfenergy: -932.693548 hartree
pointgroup: C01 [X(C16H15N3O2)]
dipole: 1.0331789 -2.3953528 -2.660118 debye
polarizability: 334.2842336|-41.4580382|257.5924625|6.3503752|-10.3282155|213.3642284 unknown
InChI: InChI=1/16C.3N.2O.15H
charge 0 multiplicity 1
36 atoms
C  3.48676905 0.21420811 0.38036373
O  3.08151624 0.19240722 1.5394555
C  1.37565601 1.136313 -0.43461885
H  1.32114838 1.67565195 0.52194241
H  1.10859661 1.85176271 -1.22427678
C  0.37893962 -0.00274865 -0.4224112
H  0.60105673 -0.70745639 0.39688711
H  0.40491042 -0.56251737 -1.37331006
C  -1.98221269 -0.22383161 -0.17938334
C  -3.23078306 0.42089241 0.00353849
C  -1.94466934 -1.61756955 -0.2910932
C  -4.41120259 -0.33606058 0.07131455
C  -3.12864427 -2.34897754 -0.22093482
H  -0.9944452 -2.13380203 -0.43037437
C  -4.36179699 -1.71979873 -0.0408993
H  -3.08175012 -3.43708411 -0.3089803
C  -3.26928787 1.83744616 0.11560974
N  -3.31354713 2.9998302 0.20754069
N  4.73893273 -0.2103727 -0.01374765
N  2.72456762 0.68584788 -0.65011954
H  4.95715612 -0.12015072 -1.00117472
H  3.05884447 0.60840957 -1.60473386
O  -0.90753478 0.57689478 -0.23298392
H  -5.36175776 0.18143361 0.21295713
H  -5.28059616 -2.30605962 0.0123213
C  5.77213617 -0.73648821 0.76361468
C  6.95934147 -1.08888421 0.09475217
C  5.69764807 -0.93161778 2.15367743
C  8.0392216 -1.61858591 0.7917253
H  7.02531935 -0.94027255 -0.98694457
C  6.79013973 -1.46469599 2.83691171
H  4.79105262 -0.66509423 2.69129918
C  7.96542068 -1.8119626 2.17228643
H  8.94884415 -1.88236135 0.24593062
H  6.71260046 -1.60811634 3.91808961
H  8.81335712 -2.22743465 2.72138666
