program: Gaussian 16
title: Title Card Required
version: ES64L-G16RevC.01
method: UwB97XD
basis: def2TZVP
operation: Freq
keyword: #N
keyword: Geom=AllCheck
keyword: Guess=TCheck
keyword: SCRF=Check
keyword: GenChk
keyword: UwB97XD/def2TZVP
keyword: Freq
converged: YES YES NO YES
elementType: C
elementType: H
elementType: S
elementType: F
1716.lowfreq: 0.0002 0.0006 0.0009 1.6651 4.2019 5.0615 16.3962 18.7286 32.8426
frequency: 12.2347 18.4874 32.8423 34.1180 42.1017 65.4189 88.7329 94.5411 145.5969 150.1144 157.0520 242.9045 255.0442 298.8789 305.9105 322.2517 335.5004 338.5523 358.0065 364.5871 378.3643 380.0723 432.1959 437.5240 445.9201 447.2000 474.8381 478.4690 547.1697 547.5995 562.9684 566.2697 566.9008 573.5380 576.4488 578.5248 580.2394 601.5783 697.5188 752.9420 753.3454 784.6867 786.4902 795.1241 823.0011 823.7036 840.1587 851.2328 852.3797 879.0033 910.8965 914.0888 963.2425 964.5979 970.1306 973.1106 975.6887 1006.1691 1020.6940 1037.8622 1039.0163 1060.6685 1062.0407 1066.1368 1087.2520 1088.8951 1119.4911 1119.5427 1126.1221 1126.4551 1138.4728 1139.3306 1146.6316 1147.2044 1153.3263 1153.5070 1155.4605 1157.2534 1157.9193 1173.5540 1182.4557 1183.5963 1194.7515 1195.7601 1213.3416 1213.9813 1214.9702 1237.8910 1243.4273 1248.1664 1265.1188 1388.6547 1457.2938 1497.5407 1497.6453 1500.5355 1500.7236 1504.7909 1505.4711 1553.9048 1563.5213 1580.7513 3065.2365 3065.4905 3074.9485 3090.2161 3090.4187 3096.0786 3098.0165 3098.2847 3103.9909 3134.0156 3137.6751 3137.9565 3164.8798 3167.6569 3167.8681 3172.3488 3175.7239 3177.2646
redmass: 6.0867 8.6027 6.6987 6.1449 2.8362 2.6892 6.6657 6.2803 5.1123 5.0793 7.7525 6.4586 6.1774 9.0977 9.3552 16.2775 6.5626 6.2993 13.0892 7.3031 4.3308 5.0777 5.8495 3.6378 5.6742 3.9320 5.5982 6.1273 1.8750 1.8766 15.5253 2.1125 2.0595 6.5997 2.8748 2.1408 4.0193 18.7679 14.7092 3.1738 3.1790 24.6661 25.1777 15.0443 2.9003 2.9053 2.7427 2.6275 2.6329 4.2637 4.4022 5.1913 3.2590 1.2430 1.2345 1.2090 1.0299 1.0096 1.0301 3.7224 3.6830 2.7816 2.7444 2.6379 2.2692 2.2393 1.3108 1.3100 1.3106 1.3111 1.4349 1.4324 1.4338 1.4391 1.6878 1.7078 12.9073 1.3966 1.3944 4.0043 1.5956 1.5931 2.1891 2.2079 3.1931 2.1695 2.6534 1.8497 13.1250 13.1298 1.8481 4.6490 2.8899 1.1091 1.1089 1.1023 1.1025 1.1064 1.1061 1.2015 1.2355 1.5792 1.0541 1.0542 1.0557 1.0540 1.0540 1.0547 1.0546 1.0555 1.0563 1.1134 1.1112 1.1112 1.1144 1.1130 1.1130 1.1141 1.1136 1.1135
irintensity: 0.0568 0.0629 0.7758 0.6258 0.0730 0.0066 0.2363 0.2421 0.1479 0.0110 1.9056 0.3372 0.4720 0.7443 1.7699 0.9062 2.5811 0.6509 5.2368 13.5620 1.0845 1.4365 0.6414 1.5234 1.1732 21.7651 0.0343 0.1697 0.6187 0.7760 0.6805 0.8373 0.7396 0.7268 0.6331 0.0836 1.0368 5.8344 532.6639 1.1090 1.0741 410.5207 413.4940 58.4005 0.0361 0.0580 11.2724 0.7157 0.7234 2.9424 5.7557 0.9754 0.0151 0.0002 0.0003 0.0052 0.0011 0.0022 0.0086 0.1102 0.0948 0.0154 0.0137 20.0740 0.4623 0.4935 1.3613 1.3107 0.4292 0.4738 0.9163 0.7942 0.1155 0.2649 1.8950 2.1503 327.1498 1.0282 0.8827 2.6529 0.9729 0.7969 1.4775 1.4475 3.0749 54.9724 27.7664 3.8159 346.5112 356.5951 197.2797 26.4457 0.4549 3.0454 3.0330 2.0843 1.9533 2.8704 2.8053 0.3042 1.0965 0.0383 72.8140 72.8678 0.0615 62.3244 61.7970 43.9335 43.6260 0.4064 1.7871 0.0505 64.8905 65.1131 0.0515 47.7015 47.5276 8.0142 26.2025 31.1783
temp: 298.150 k
press: 1.00000 atm
elementType: 6 1 1 6 1 1 6 1 1 6 6 6 6 6 6 1 1 6 1 1 1 1 16 9 9 9 9 6 6 6 6 1 1 6 1 1 1 1 6 9 9 9
symmnumber: 1
zpe: 842143.6 jmol-1
zpe.correction: 0.320756 hartree
zpe.thermalcorrener: 0.341935 hartree
zpe.thermalcorrenthalpy: 0.342879 hartree
zpe.thermalcorrgfe: 0.266834 hartree
zpe.sumelectzpe: -1717.120759 hartree
zpe.sumelectthermal: -1717.099579 hartree
zpe.sumelectthermalent: -1717.098635 hartree
zpe.sumelectthermalfe: -1717.174680 hartree
dipole: 2.2296 -0.9148 -0.3330
dipole: 2.4329
quadrupole: -182.7591 -154.6160 -144.1191
quadrupole: 22.7404 7.6540 -4.1859
quadrupole: -22.2610 5.8820 16.3790 22.7404 7.6540 -4.1859
hfenergy: -1717.4415144 hartree
pointgroup: C01 [X(C16H18F7S1)]
dipole: 0.8772067 -0.359904 -0.1310061 debye
polarizability: 269.7871152|-25.4128131|226.8271218|-11.0500576|5.1294678|217.263497 unknown
InChI: InChI=1/16C.7F.S.18H
charge 0 multiplicity 2
42 atoms
C  0.42940785 1.19390811 0.95050009
H  0.83381837 1.63792882 1.86118899
H  -0.00087356 0.2077988 1.13069873
C  -0.02487951 1.17237215 -1.14361449
H  -0.03608303 1.59669764 -2.14854237
H  -0.48696808 0.18475987 -1.10987565
C  0.9633236 2.8660059 -0.27892402
H  1.02148567 3.40932654 -1.22308834
H  1.40531068 3.42732832 0.54548857
C  1.28445213 1.35031206 -0.33305014
C  -0.37314242 2.13826897 0.01849585
C  -1.68389043 2.76045888 0.29757843
C  -2.02786479 3.72634147 1.46972334
C  -3.0220323 2.02434663 0.59359682
C  -2.48546852 3.71070689 -0.63829552
H  -1.57463723 4.71518161 1.43395889
H  -2.02614572 3.29742287 2.47008354
C  -3.31058584 3.53396919 0.64705808
H  -3.4684699 1.47600745 -0.23367807
H  -3.08169892 1.48730987 1.53787152
H  -2.8985936 3.26799104 -1.542627
H  -2.05987261 4.69762867 -0.80721174
S  -4.92731779 4.2865248 0.97962877
F  -5.33065801 3.07938087 1.98377536
F  -5.56954032 3.48553094 -0.28543879
F  -4.59073364 5.55610083 0.03173499
F  -4.37911465 5.12310875 2.246188
C  2.60504644 0.72171858 -0.61317812
C  3.44181135 0.8957821 -1.91106651
C  3.90328026 0.91649067 0.21846909
C  2.89623531 -0.80403733 -0.66146399
H  3.02818613 0.45026223 -2.81407645
H  3.86704051 1.88338925 -2.08080758
C  4.20105347 -0.03943669 -0.95162653
H  3.90225513 0.48953678 1.21983681
H  4.35672 1.90533805 0.17853658
H  2.83352198 -1.33638091 0.28599747
H  2.44899031 -1.3534907 -1.48797925
C  -6.69794961 5.00650596 1.23344872
F  -6.74059886 5.80320348 2.28329996
F  -7.05999367 5.6884042 0.16303516
F  -7.55637445 4.01965993 1.41060991
