program: Gaussian 16
title: Title Card Required
version: ES64L-G16RevC.01
method: RwB97XD
basis: def2TZVP
operation: Freq
keyword: #N
keyword: Geom=AllCheck
keyword: Guess=TCheck
keyword: SCRF=Check
keyword: GenChk
keyword: RwB97XD/def2TZVP
keyword: Freq
converged: YES YES NO NO
title: Mulliken charges:
elementType: C H H C H H C H H C C C C C C H H C H H H H S F F F F Cl C F F F
charge: -0.107423 0.117343 0.117344 -0.107901 0.117304 0.117416 -0.108380 0.117423 0.117488 0.005319 -0.359761 -0.130296 -0.042161 -0.053005 -0.057916 0.124894 0.124857 -0.137150 0.127232 0.126463 0.128260 0.127547 0.763597 -0.242834 -0.251856 -0.245791 -0.235538 -0.139747 0.414782 -0.142202 -0.142722 -0.142582
chargesum: -0.00000
title: Mulliken charges with hydrogens summed into heavy atoms:
elementType: C C C C C C C C C C S F F F F Cl C F F F
charge: 0.127264 0.126818 0.126531 0.005319 -0.359761 -0.130296 0.207589 0.200690 0.197890 -0.137150 0.763597 -0.242834 -0.251856 -0.245791 -0.235538 -0.139747 0.414782 -0.142202 -0.142722 -0.142582
chargesum: 0.00000
1716.lowfreq: -3.8811 -0.0016 -0.0008 0.0015 2.0828 6.8701 12.2019 20.0279 40.9501
frequency: 11.3316 17.2046 40.9478 43.9406 54.4297 109.2800 117.9015 174.1563 217.0613 223.1149 279.5589 290.8717 306.0479 322.5242 325.8669 352.2053 359.1627 365.5253 390.6358 422.6431 424.7039 443.3402 473.9132 477.8429 483.3973 560.4379 561.4480 564.3533 572.0864 574.8051 576.5511 580.0448 603.5868 697.9571 787.3021 788.2752 795.5517 807.1283 807.9144 840.8859 842.1362 897.2314 915.3660 924.5909 971.6865 975.1366 1001.4609 1019.7041 1060.6775 1068.7075 1069.3162 1091.6537 1092.9464 1136.9058 1137.3366 1144.4757 1145.6181 1155.1147 1157.9689 1158.6832 1174.6058 1175.5922 1191.4676 1192.2518 1194.8153 1213.7028 1213.8758 1242.0463 1244.0405 1248.4966 1266.2615 1457.5408 1502.9502 1503.2189 1505.3166 1505.9568 1562.1360 1578.2134 3085.7469 3086.3505 3093.9948 3097.4754 3099.9579 3105.5761 3159.9709 3163.2597 3163.5824 3173.9897 3177.5813 3179.5759
redmass: 16.8692 4.0864 10.2767 9.2500 2.7417 9.0055 8.9787 11.4058 7.6516 7.2445 5.9216 5.4045 13.1314 16.2496 10.7052 9.0266 6.7676 10.4881 8.0570 4.4885 3.8015 9.2479 6.3837 6.9184 4.9360 1.9389 1.9356 16.5480 4.7509 2.6261 2.6730 5.1789 18.7635 14.7916 24.1391 24.6924 15.1921 2.9787 2.9750 2.7763 2.7949 3.4427 5.3655 3.8549 1.2169 1.2336 1.0212 1.0286 2.7406 2.8794 2.8539 2.2703 2.2644 1.4146 1.4170 1.3728 1.3755 13.0189 1.4007 1.3929 1.4769 1.5079 1.9394 1.8643 4.6535 3.2230 3.2354 1.8180 13.1262 13.1308 1.8110 3.2909 1.1079 1.1078 1.1065 1.1061 1.1894 1.4747 1.0546 1.0546 1.0564 1.0547 1.0548 1.0564 1.1143 1.1129 1.1130 1.1142 1.1137 1.1137
irintensity: 0.1280 0.0054 1.2881 1.1906 0.0499 0.6283 0.6146 1.4228 0.1655 0.0480 0.1489 0.3666 0.8891 0.7251 1.0229 1.9908 2.4687 3.0707 64.2865 0.8381 1.0464 0.2923 0.2283 0.4457 7.0691 0.5200 0.5850 0.3833 1.0912 0.9000 0.1196 1.0328 7.2940 528.5470 407.7778 412.0529 63.5494 2.1195 2.0155 0.6942 0.7620 47.9094 5.4995 32.7287 0.0025 0.0022 0.0006 0.0109 90.0241 0.0838 0.1679 0.3194 0.3672 1.0607 1.1973 0.1418 0.1490 306.6495 1.1279 0.6861 0.1682 0.2985 5.9966 5.8694 141.8767 1.9337 1.7022 25.9620 347.8103 357.9740 190.5842 1.1643 3.9012 4.0204 2.6608 2.9965 3.2072 3.6436 54.7906 53.7476 0.0643 45.2021 41.8071 2.2644 0.4926 44.1892 43.9532 8.5343 26.1930 26.8295
temp: 298.150 k
press: 1.00000 atm
elementType: 6 1 1 6 1 1 6 1 1 6 6 6 6 6 6 1 1 6 1 1 1 1 16 9 9 9 9 17 6 9 9 9
symmnumber: 1
zpe: 594377.8 jmol-1
zpe.correction: 0.226387 hartree
zpe.thermalcorrener: 0.244501 hartree
zpe.thermalcorrenthalpy: 0.245445 hartree
zpe.thermalcorrgfe: 0.177042 hartree
zpe.sumelectzpe: -1983.428094 hartree
zpe.sumelectthermal: -1983.409979 hartree
zpe.sumelectthermalent: -1983.409035 hartree
zpe.sumelectthermalfe: -1983.477438 hartree
dipole: 0.2509 1.2306 -0.1533
dipole: 1.2652
quadrupole: -128.1288 -157.7988 -126.5630
quadrupole: -9.9598 2.1836 7.1749
quadrupole: 9.3681 -20.3019 10.9339 -9.9598 2.1836 7.1749
hfenergy: -1983.6544802 hartree
pointgroup: C01 [X(C11H12Cl1F7S1)]
dipole: 0.0987198 0.4841386 -0.0603309 debye
polarizability: 171.6410238|19.0762986|226.2898689|-4.1721531|-13.0693174|168.3028896 unknown
InChI: InChI=1/11C.Cl.7F.S.12H
charge 0 multiplicity 1
32 atoms
C  1.7835173 1.50790933 -0.69839875
H  2.68955114 1.34980394 -0.11488256
H  1.90574536 1.2378322 -1.74651278
C  -0.2674985 2.11747502 -0.95239323
H  -1.2194286 2.51167941 -0.59908263
H  -0.27688726 1.88637066 -2.01676273
C  0.66376225 2.25065382 0.98604183
H  -0.22844555 2.65347255 1.46368035
H  1.49786757 2.14040632 1.6778045
C  0.99985885 2.79938743 -0.41065717
C  0.4445653 1.09137309 -0.02649135
C  -0.00202627 -0.28182094 0.28219638
C  -1.34120105 -0.69640358 0.95827278
C  0.7126426 -1.30895018 1.20570477
C  -0.22515808 -1.43922549 -0.73160186
H  -2.24823951 -0.53973566 0.37756669
H  -1.45985292 -0.4291872 2.00650485
C  -0.55867539 -1.98656552 0.66726276
H  1.66059889 -1.70670579 0.84855041
H  0.72434797 -1.07940513 2.26905234
H  0.66436037 -1.8447429 -1.20946685
H  -1.06108239 -1.32773713 -1.41884283
S  -1.09528291 -3.67864776 1.03452346
F  -0.31769875 -3.67702099 2.45401832
F  0.22812964 -4.26734816 0.29042611
F  -1.94060215 -3.74991737 -0.34686353
F  -2.42815916 -3.18514581 1.79768719
Cl 1.53411724 4.44283924 -0.78023217
C  -1.56651383 -5.52312132 1.34013592
F  -2.73547931 -5.61988215 1.94211195
F  -1.62624855 -6.15983037 0.18562795
F  -0.64784989 -6.10133256 2.09029398
