program: Gaussian 16
title: Title Card Required
version: ES64L-G16RevC.01
method: UwB97XD
basis: def2TZVP
operation: Freq
keyword: #N
keyword: Geom=AllCheck
keyword: Guess=TCheck
keyword: SCRF=Check
keyword: GenChk
keyword: UwB97XD/def2TZVPFreq
converged: YES YES NO NO
elementType: C
elementType: H
elementType: S
elementType: F
1716.lowfreq: -65.2547 -3.4148 -0.0017 0.0005 0.0013 2.3795 8.4139 9.9246 12.2108
frequency: -65.2539 8.7360 11.3674 13.5079 22.7574 28.0048 72.5059 74.5403 119.9616 129.3903 230.6737 249.5637 264.1871 301.7016 321.4518 339.6330 347.4948 351.2222 364.7847 426.6203 447.3998 455.5862 539.2153 541.9921 551.6630 553.4681 554.4976 560.7268 571.7701 576.5994 607.2557 685.3162 716.0948 716.3542 762.7358 763.7265 775.8053 776.6898 789.8304 815.2731 861.2116 875.6844 930.6230 965.8132 969.2067 994.9551 1077.8891 1078.3850 1089.5280 1089.8883 1095.2234 1108.4479 1109.1907 1113.9855 1128.7651 1130.0366 1132.9935 1142.2377 1144.4362 1153.5017 1154.1157 1154.4474 1197.2177 1197.6857 1215.7769 1237.2690 1237.8536 1243.0172 1246.7528 1496.8227 1497.1883 1502.2250 1502.8877 1542.8965 1554.9994 3119.0403 3120.5902 3124.8282 3146.6818 3147.6960 3151.2303 3200.7728 3203.4403 3204.4673 3236.0210 3237.7158 3238.0528
redmass: 6.6739 6.8267 6.0508 9.2874 4.0597 2.8580 4.3031 4.1463 6.9475 7.4174 7.0120 6.7261 6.2411 15.3159 17.3795 8.8147 14.5906 8.2196 13.0760 15.6775 12.0898 13.4613 1.8415 1.8486 2.0532 5.2420 2.5080 17.2108 16.4298 16.8673 5.2280 15.2607 2.9372 2.9357 22.3739 21.4392 3.1839 3.1958 11.5196 7.5102 4.5456 6.5925 1.0091 1.1622 1.2279 1.0670 2.6415 2.6138 1.2174 1.2168 4.1486 1.9897 1.9895 4.1606 1.2777 1.2734 1.2715 1.3997 1.3972 12.3900 1.4498 1.4481 2.3770 2.3573 1.5207 3.2753 3.2609 13.1317 13.1393 1.1584 1.1583 1.1176 1.1173 1.1920 1.1737 1.0546 1.0545 1.0563 1.0551 1.0551 1.0568 1.1154 1.1153 1.1154 1.1175 1.1183 1.1186
irintensity: 2.4939 0.3314 0.3471 0.0295 0.0085 0.0004 0.0978 0.1113 0.0003 0.0109 37.1061 10.9776 0.7480 2.7798 0.8388 19.9232 23.8852 5.5563 8.3020 0.1131 0.2350 0.1167 0.1649 0.1134 0.0554 1.2783 1.0988 29.6620 2.7554 3.5572 453.0065 497.3239 0.0060 0.0022 435.5170 433.1741 6.2118 3.9563 12.1559 54.5600 15.7809 11.3642 0.0007 0.0059 0.0017 0.0009 0.8476 0.7766 0.0168 0.0201 43.4043 1.4477 1.5116 22.8456 0.9341 0.8420 1.3135 0.1490 0.2407 393.5480 0.8568 0.5223 3.3252 3.2959 143.3991 2.1086 1.9212 347.3836 357.0572 4.3144 4.2789 3.9176 3.9884 1.1167 1.9149 30.3670 29.8179 1.1063 25.4240 25.8508 1.8861 6.2601 14.0766 18.5528 1.3270 8.1370 9.5944
temp: 298.150 k
press: 1.00000 atm
elementType: 6 1 1 6 1 1 6 1 1 6 6 16 9 9 9 9 6 6 6 6 1 1 6 1 1 1 1 6 9 9 9
symmnumber: 1
zpe: 572675.1 jmol-1
zpe.correction: 0.218120 hartree
zpe.thermalcorrener: 0.236244 hartree
zpe.thermalcorrenthalpy: 0.237188 hartree
zpe.thermalcorrgfe: 0.164800 hartree
zpe.sumelectzpe: -1523.065320 hartree
zpe.sumelectthermal: -1523.047197 hartree
zpe.sumelectthermalent: -1523.046253 hartree
zpe.sumelectthermalfe: -1523.118641 hartree
dipole: 3.4694 -0.1699 -0.1095
dipole: 3.4753
quadrupole: -133.3144 -111.0977 -110.9175
quadrupole: 0.0851 -1.4323 0.0630
quadrupole: -14.8712 7.3455 7.5257 0.0851 -1.4323 0.0630
hfenergy: -1523.2834408 hartree
pointgroup: C01 [X(C11H12F7S1)]
dipole: 1.3649852 -0.0668463 -0.0430955 debye
polarizability: 267.3785048|0.9733521|160.1827387|-1.2165057|-0.0169236|159.851158 unknown
InChI: InChI=1/11C.7F.S.12H
charge 0 multiplicity 2
31 atoms
C  0.28710472 -1.21529047 -0.38419976
H  0.30438466 -1.74671785 0.5631292
H  0.25808764 -1.86897261 -1.25133309
C  0.24059117 0.60417621 -1.60285576
H  0.21484694 1.68231778 -1.73310353
H  0.21029206 0.0497212 -2.53609065
C  0.29692781 0.7505224 0.58065218
H  0.27475006 1.83647313 0.56699408
H  0.31605662 0.32558347 1.57982543
C  1.15203166 0.05437665 -0.49166905
C  -0.59868997 0.0377625 -0.44599585
S  -2.46631303 0.04176792 -0.39636707
F  -2.55786863 -0.05091725 -2.01715784
F  -2.46726535 1.67663359 -0.46941875
F  -2.46353643 0.08623484 1.23109088
F  -2.55706186 -1.57406926 -0.32741025
C  3.66534535 0.13012646 -0.48945787
C  4.38208178 1.4511242 -0.38611496
C  4.4488901 -0.56181516 0.59535656
C  4.47894204 -0.40363949 -1.6395409
H  4.36858126 2.0941976 -1.25807632
H  4.34389344 1.96442102 0.56737388
C  5.23607873 0.19474546 -0.46377294
H  4.49253893 -1.64404116 0.56463489
H  4.41352004 -0.12863839 1.58790377
H  4.52400475 -1.47947163 -1.76021851
H  4.46942191 0.16484151 -2.56189908
C  -4.38627403 0.18621423 -0.33498294
F  -4.94707603 -1.00061397 -0.20957762
F  -4.74041477 0.93635843 0.69161948
F  -4.82812741 0.7547948 -1.44077022
