program: Gaussian 03
title: Br_-
version: AM64L-G03RevD.02
method: RB3LYP
basis: 6-31+G(d)
operation: SP
keyword: #N
keyword: b3lyp/6-31+g*
keyword: SCRF=(CPCM,Solvent=CH2Cl2)
keyword: geom=allcheck
keyword: guess=read
title: #N b3lyp/6-31+g* SCRF=(CPCM,Solvent=CH2Cl2) geom=allcheck guess=read
title: Mulliken atomic charges:
elementType: Br
charge: -1.000000
chargesum: -1.00000
dipole: 0.0000 0.0000 0.0000
dipole: 0.0000
quadrupole: -23.5843 -23.5843 -23.5843
quadrupole: 0.0000 0.0000 0.0000
quadrupole: 0.0000 0.0000 0.0000 0.0000 0.0000 0.0000
hfenergy: -2571.8977019 hartree
pointgroup: OH [O(Br1)]
dipole: 0. 0. 0. debye
InChI: InChI=1/Br
charge -1 multiplicity 1
1 atoms
Br 0.0000 0.0000 0.0000
